BDBM50163999 4-(4-Chloro-benzenesulfonyl)-4-o-tolyl-piperidine-1-carboxylic acid ethyl ester::CHEMBL183805
SMILES: CCOC(=O)N1CCC(CC1)(c1ccccc1C)S(=O)(=O)c1ccc(Cl)cc1
InChI Key: InChIKey=VPPCVFUXHPKUGU-UHFFFAOYSA-N
Data: 2 EC50
Activity Spreadsheet -- Enzyme Inhibition Constant Data from BindingDB
Found 2 hits for monomerid = 50163999
Trg + Lig
Ki
nM
ΔG°
kcal/mole
IC50
nM
Kd
nM
EC50/IC50
nM
koff
s-1
kon
M-1s-1
pHTemp
°C
Beta amyloid A4 protein
(Homo sapiens (Human))
BDBM50163999
(4-(4-Chloro-benzenesulfonyl)-4-o-tolyl-piperidine-...)
Show SMILES CCOC(=O)N1CCC(CC1)(c1ccccc1C)S(=O)(=O)c1ccc(Cl)cc1
Show InChI InChI=1S/C21H24ClNO4S/c1-3-27-20(24)23-14-12-21(13-15-23,19-7-5-4-6-16(19)2)28(25,26)18-10-8-17(22)9-11-18/h4-11H,3,12-15H2,1-2H3
Reactome pathway
n/an/an/an/a 2.70E+3n/an/an/an/a
Wyeth Research
Curated by ChEMBL
Assay Description
In vitro effective concentration against beta amyloid protein 40 in ELISA
Bioorg Med Chem Lett 15: 1891-4 (2005)
Article DOI: 10.1016/j.bmcl.2005.02.006
BindingDB Entry DOI: 10.7270/Q2N879B4
Beta amyloid A4 protein
(Homo sapiens (Human))
BDBM50163999
(4-(4-Chloro-benzenesulfonyl)-4-o-tolyl-piperidine-...)
Show SMILES CCOC(=O)N1CCC(CC1)(c1ccccc1C)S(=O)(=O)c1ccc(Cl)cc1
Show InChI InChI=1S/C21H24ClNO4S/c1-3-27-20(24)23-14-12-21(13-15-23,19-7-5-4-6-16(19)2)28(25,26)18-10-8-17(22)9-11-18/h4-11H,3,12-15H2,1-2H3
Reactome pathway
n/an/an/an/a 3.70E+3n/an/an/an/a
Wyeth Research
Curated by ChEMBL
Assay Description
In vitro effective concentration against beta amyloid protein 42 in ELISA
Bioorg Med Chem Lett 15: 1891-4 (2005)
Article DOI: 10.1016/j.bmcl.2005.02.006
BindingDB Entry DOI: 10.7270/Q2N879B4