BDBM50164032 CHEMBL361169::N*1*-[2,2'']Bithiophenyl-5-ylmethyl-2,2-dimethyl-N*4*-(2''-sulfamoyl-biphenyl-4-ylmethyl)-succinamide
SMILES: CC(C)(CC(=O)NCc1ccc(cc1)-c1ccccc1S(N)(=O)=O)C(=O)NCc1ccc(s1)-c1cccs1
InChI Key: InChIKey=JVIWKDKMCIZSIW-UHFFFAOYSA-N
Data: 1 IC50
Activity Spreadsheet -- Enzyme Inhibition Constant Data from BindingDB
Found 1 hit for monomerid = 50164032
Trg + Lig
Ki
nM
ΔG°
kcal/mole
IC50
nM
Kd
nM
EC50/IC50
nM
koff
s-1
kon
M-1s-1
pHTemp
°C
Sodium channel protein type 9 subunit alpha
(Homo sapiens (Human))
BDBM50164032
(CHEMBL361169 | N*1*-[2,2'']Bithiophenyl-5-ylmethyl...)
Show SMILES CC(C)(CC(=O)NCc1ccc(cc1)-c1ccccc1S(N)(=O)=O)C(=O)NCc1ccc(s1)-c1cccs1
Show InChI InChI=1S/C28H29N3O4S3/c1-28(2,27(33)31-18-21-13-14-24(37-21)23-7-5-15-36-23)16-26(32)30-17-19-9-11-20(12-10-19)22-6-3-4-8-25(22)38(29,34)35/h3-15H,16-18H2,1-2H3,(H,30,32)(H,31,33)(H2,29,34,35)
n/an/a 2.30E+3n/an/an/an/an/an/a
Merck Research Laboratories
Curated by ChEMBL
Assay Description
In vitro inhibitory concentration against voltage-gated sodium channel Nav1.7 in voltage-ion-probe-reader (VIPR) assay
Bioorg Med Chem Lett 15: 1901-7 (2005)
Article DOI: 10.1016/j.bmcl.2005.02.002
BindingDB Entry DOI: 10.7270/Q2HH6JMD