BDBM50164075 (1S,2S)-Cyclopentane-1,2-dicarboxylic acid 1-[([2,2'']bithiophenyl-5-ylmethyl)-amide] 2-[methyl-(2''-sulfamoyl-biphenyl-4-ylmethyl)-amide]::CHEMBL369537
SMILES: CN(Cc1ccc(cc1)-c1ccccc1S(N)(=O)=O)C(=O)[C@H]1CCC[C@@H]1C(=O)NCc1ccc(s1)-c1cccs1
InChI Key: InChIKey=YBSCSPYCJKMRGI-DQEYMECFSA-N
Data: 1 IC50
Activity Spreadsheet -- Enzyme Inhibition Constant Data from BindingDB
Found 1 hit for monomerid = 50164075
Trg + Lig
Ki
nM
ΔG°
kcal/mole
IC50
nM
Kd
nM
EC50/IC50
nM
koff
s-1
kon
M-1s-1
pHTemp
°C
Sodium channel protein type 9 subunit alpha
(Homo sapiens (Human))
BDBM50164075
((1S,2S)-Cyclopentane-1,2-dicarboxylic acid 1-[([2,...)
Show SMILES CN(Cc1ccc(cc1)-c1ccccc1S(N)(=O)=O)C(=O)[C@H]1CCC[C@@H]1C(=O)NCc1ccc(s1)-c1cccs1
Show InChI InChI=1S/C30H31N3O4S3/c1-33(19-20-11-13-21(14-12-20)23-6-2-3-10-28(23)40(31,36)37)30(35)25-8-4-7-24(25)29(34)32-18-22-15-16-27(39-22)26-9-5-17-38-26/h2-3,5-6,9-17,24-25H,4,7-8,18-19H2,1H3,(H,32,34)(H2,31,36,37)/t24-,25-/m0/s1
n/an/a 760n/an/an/an/an/an/a
Merck Research Laboratories
Curated by ChEMBL
Assay Description
In vitro inhibitory concentration against voltage-gated sodium channel Nav1.7 in voltage-ion-probe-reader (VIPR) assay
Bioorg Med Chem Lett 15: 1901-7 (2005)
Article DOI: 10.1016/j.bmcl.2005.02.002
BindingDB Entry DOI: 10.7270/Q2HH6JMD