BDBM50164230 6-[5-(4-Fluoro-phenyl)-2-isopropyl-3H-imidazol-4-yl]-1-(propane-2-sulfonyl)-1H-benzoimidazol-2-ylamine; compound with methanesulfonic acid::CHEMBL364925
SMILES: CC(C)c1nc(c([nH]1)-c1ccc(F)cc1)-c1ccc2nc(N)n(c2c1)S(=O)(=O)C(C)C
InChI Key: InChIKey=OBNKFIQHMAHNEE-UHFFFAOYSA-N
Data: 2 IC50
Activity Spreadsheet -- Enzyme Inhibition Constant Data from BindingDB
Found 2 hits for monomerid = 50164230
Trg + Lig
Ki
nM
ΔG°
kcal/mole
IC50
nM
Kd
nM
EC50/IC50
nM
koff
s-1
kon
M-1s-1
pHTemp
°C
Cytochrome P450 3A4
(Homo sapiens (Human))
BDBM50164230
(6-[5-(4-Fluoro-phenyl)-2-isopropyl-3H-imidazol-4-y...)
Show SMILES CC(C)c1nc(c([nH]1)-c1ccc(F)cc1)-c1ccc2nc(N)n(c2c1)S(=O)(=O)C(C)C
Show InChI InChI=1S/C22H24FN5O2S/c1-12(2)21-26-19(14-5-8-16(23)9-6-14)20(27-21)15-7-10-17-18(11-15)28(22(24)25-17)31(29,30)13(3)4/h5-13H,1-4H3,(H2,24,25)(H,26,27)
Reactome pathway
n/an/a 6.10E+3n/an/an/an/an/an/a
Eli Lilly and Co.
Curated by ChEMBL
Assay Description
In vitro inhibitory concentration against Cytochrome P450 3A4
J Med Chem 48: 2270-3 (2005)
Article DOI: 10.1021/jm048978k
BindingDB Entry DOI: 10.7270/Q2M90869
Mitogen-activated protein kinase 14
(Homo sapiens (Human))
BDBM50164230
(6-[5-(4-Fluoro-phenyl)-2-isopropyl-3H-imidazol-4-y...)
Show SMILES CC(C)c1nc(c([nH]1)-c1ccc(F)cc1)-c1ccc2nc(N)n(c2c1)S(=O)(=O)C(C)C
Show InChI InChI=1S/C22H24FN5O2S/c1-12(2)21-26-19(14-5-8-16(23)9-6-14)20(27-21)15-7-10-17-18(11-15)28(22(24)25-17)31(29,30)13(3)4/h5-13H,1-4H3,(H2,24,25)(H,26,27)
NCI pathway
Reactome pathway
n/an/a 4.5n/an/an/an/an/an/a
Eli Lilly and Co.
Curated by ChEMBL
Assay Description
Inhibition of human recombinant Mitogen activated protein kinase p38 alpha activity using ATP[gamma-33P] and EGFR 21mer-peptide
J Med Chem 48: 2270-3 (2005)
Article DOI: 10.1021/jm048978k
BindingDB Entry DOI: 10.7270/Q2M90869