BDBM50164231 6-[2-(1-Isobutyl-piperidin-4-yl)-5-phenyl-3H-imidazol-4-yl]-1-(propane-2-sulfonyl)-1H-benzoimidazol-2-ylamine::CHEMBL371145
SMILES: CC(C)CN1CCC(CC1)c1nc(c([nH]1)-c1ccccc1)-c1ccc2nc(N)n(c2c1)S(=O)(=O)C(C)C
InChI Key: InChIKey=REKGBSFMGZYROU-UHFFFAOYSA-N
Data: 2 IC50
Activity Spreadsheet -- Enzyme Inhibition Constant Data from BindingDB
Found 2 hits for monomerid = 50164231
Trg + Lig
Ki
nM
ΔG°
kcal/mole
IC50
nM
Kd
nM
EC50/IC50
nM
koff
s-1
kon
M-1s-1
pHTemp
°C
Mitogen-activated protein kinase 14
(Homo sapiens (Human))
BDBM50164231
(6-[2-(1-Isobutyl-piperidin-4-yl)-5-phenyl-3H-imida...)
Show SMILES CC(C)CN1CCC(CC1)c1nc(c([nH]1)-c1ccccc1)-c1ccc2nc(N)n(c2c1)S(=O)(=O)C(C)C
Show InChI InChI=1S/C28H36N6O2S/c1-18(2)17-33-14-12-21(13-15-33)27-31-25(20-8-6-5-7-9-20)26(32-27)22-10-11-23-24(16-22)34(28(29)30-23)37(35,36)19(3)4/h5-11,16,18-19,21H,12-15,17H2,1-4H3,(H2,29,30)(H,31,32)
NCI pathway
Reactome pathway
n/an/a 5.5n/an/an/an/an/an/a
Eli Lilly and Co.
Curated by ChEMBL
Assay Description
Inhibition of human recombinant Mitogen activated protein kinase p38 alpha activity using ATP[gamma-33P] and EGFR 21mer-peptide
J Med Chem 48: 2270-3 (2005)
Article DOI: 10.1021/jm048978k
BindingDB Entry DOI: 10.7270/Q2M90869
Cytochrome P450 3A4
(Homo sapiens (Human))
BDBM50164231
(6-[2-(1-Isobutyl-piperidin-4-yl)-5-phenyl-3H-imida...)
Show SMILES CC(C)CN1CCC(CC1)c1nc(c([nH]1)-c1ccccc1)-c1ccc2nc(N)n(c2c1)S(=O)(=O)C(C)C
Show InChI InChI=1S/C28H36N6O2S/c1-18(2)17-33-14-12-21(13-15-33)27-31-25(20-8-6-5-7-9-20)26(32-27)22-10-11-23-24(16-22)34(28(29)30-23)37(35,36)19(3)4/h5-11,16,18-19,21H,12-15,17H2,1-4H3,(H2,29,30)(H,31,32)
Reactome pathway
n/an/a 5.30E+3n/an/an/an/an/an/a
Eli Lilly and Co.
Curated by ChEMBL
Assay Description
In vitro inhibitory concentration against Cytochrome P450 3A4
J Med Chem 48: 2270-3 (2005)
Article DOI: 10.1021/jm048978k
BindingDB Entry DOI: 10.7270/Q2M90869