BDBM50164233 6-(2-(2,6-dichlorophenyl)-4-phenyl-1H-imidazol-5-yl)-1-(isopropylsulfonyl)-1H-benzo[d]imidazol-2-amine monomesylate::6-[2-(2,6-Dichloro-phenyl)-5-phenyl-3H-imidazol-4-yl]-1-(propane-2-sulfonyl)-1H-benzoimidazol-2-ylamine; compound with methanesulfonic acid::CHEMBL192889
SMILES: CC(C)S(=O)(=O)n1c(N)nc2ccc(cc12)-c1nc([nH]c1-c1ccccc1)-c1c(Cl)cccc1Cl
InChI Key: InChIKey=SMMQBPFFQVLHOK-UHFFFAOYSA-N
Data: 3 IC50
Activity Spreadsheet -- Enzyme Inhibition Constant Data from BindingDB
Found 3 hits for monomerid = 50164233
Trg + Lig
Ki
nM
ΔG°
kcal/mole
IC50
nM
Kd
nM
EC50/IC50
nM
koff
s-1
kon
M-1s-1
pHTemp
°C
Mitogen-activated protein kinase 14
(Homo sapiens (Human))
BDBM50164233
(6-(2-(2,6-dichlorophenyl)-4-phenyl-1H-imidazol-5-y...)
Show SMILES CC(C)S(=O)(=O)n1c(N)nc2ccc(cc12)-c1nc([nH]c1-c1ccccc1)-c1c(Cl)cccc1Cl
Show InChI InChI=1S/C25H21Cl2N5O2S/c1-14(2)35(33,34)32-20-13-16(11-12-19(20)29-25(32)28)23-22(15-7-4-3-5-8-15)30-24(31-23)21-17(26)9-6-10-18(21)27/h3-14H,1-2H3,(H2,28,29)(H,30,31)
NCI pathway
Reactome pathway
n/an/a 15.3n/an/an/an/an/an/a
Eli Lilly and Co.
Curated by ChEMBL
Assay Description
Inhibition of human recombinant Mitogen activated protein kinase p38 alpha activity using ATP[gamma-33P] and EGFR 21mer-peptide
J Med Chem 48: 2270-3 (2005)
Article DOI: 10.1021/jm048978k
BindingDB Entry DOI: 10.7270/Q2M90869
MAP kinase p38
(Mus musculus (mouse))
BDBM50164233
(6-(2-(2,6-dichlorophenyl)-4-phenyl-1H-imidazol-5-y...)
Show SMILES CC(C)S(=O)(=O)n1c(N)nc2ccc(cc12)-c1nc([nH]c1-c1ccccc1)-c1c(Cl)cccc1Cl
Show InChI InChI=1S/C25H21Cl2N5O2S/c1-14(2)35(33,34)32-20-13-16(11-12-19(20)29-25(32)28)23-22(15-7-4-3-5-8-15)30-24(31-23)21-17(26)9-6-10-18(21)27/h3-14H,1-2H3,(H2,28,29)(H,30,31)
Reactome pathway
n/an/a 38.9n/an/an/an/an/an/a
Eli Lilly and Co.
Curated by ChEMBL
Assay Description
Inhibition of mouse p38alpha in anisomycin-stimulated RAW 264.7 cells by ELISA
Bioorg Med Chem Lett 18: 179-83 (2008)
Article DOI: 10.1016/j.bmcl.2007.10.106
BindingDB Entry DOI: 10.7270/Q2R78G31
Mitogen-activated protein kinase 14
(Homo sapiens (Human))
BDBM50164233
(6-(2-(2,6-dichlorophenyl)-4-phenyl-1H-imidazol-5-y...)
Show SMILES CC(C)S(=O)(=O)n1c(N)nc2ccc(cc12)-c1nc([nH]c1-c1ccccc1)-c1c(Cl)cccc1Cl
Show InChI InChI=1S/C25H21Cl2N5O2S/c1-14(2)35(33,34)32-20-13-16(11-12-19(20)29-25(32)28)23-22(15-7-4-3-5-8-15)30-24(31-23)21-17(26)9-6-10-18(21)27/h3-14H,1-2H3,(H2,28,29)(H,30,31)
NCI pathway
Reactome pathway
n/an/a 15.3n/an/an/an/an/an/a
Eli Lilly and Co.
Curated by ChEMBL
Assay Description
Inhibition of human recombinant p38alpha
Bioorg Med Chem Lett 18: 179-83 (2008)
Article DOI: 10.1016/j.bmcl.2007.10.106
BindingDB Entry DOI: 10.7270/Q2R78G31