BDBM50164240 6-[5-(4-Fluoro-phenyl)-3H-imidazol-4-yl]-1-(propane-2-sulfonyl)-1H-benzoimidazol-2-ylamine; Bismesylate salt::CHEMBL192850
SMILES: CC(C)S(=O)(=O)n1c(N)nc2ccc(cc12)-c1nc[nH]c1-c1ccc(F)cc1
InChI Key: InChIKey=SXEUNZBMEKAEKG-UHFFFAOYSA-N
Data: 2 IC50
Activity Spreadsheet -- Enzyme Inhibition Constant Data from BindingDB
Found 2 hits for monomerid = 50164240
Trg + Lig
Ki
nM
ΔG°
kcal/mole
IC50
nM
Kd
nM
EC50/IC50
nM
koff
s-1
kon
M-1s-1
pHTemp
°C
Mitogen-activated protein kinase 14
(Homo sapiens (Human))
BDBM50164240
(6-[5-(4-Fluoro-phenyl)-3H-imidazol-4-yl]-1-(propan...)
Show SMILES CC(C)S(=O)(=O)n1c(N)nc2ccc(cc12)-c1nc[nH]c1-c1ccc(F)cc1
Show InChI InChI=1S/C19H18FN5O2S/c1-11(2)28(26,27)25-16-9-13(5-8-15(16)24-19(25)21)18-17(22-10-23-18)12-3-6-14(20)7-4-12/h3-11H,1-2H3,(H2,21,24)(H,22,23)
NCI pathway
Reactome pathway
n/an/a 4.30n/an/an/an/an/an/a
Eli Lilly and Co.
Curated by ChEMBL
Assay Description
Inhibition of human recombinant Mitogen activated protein kinase p38 alpha activity using ATP[gamma-33P] and EGFR 21mer-peptide
J Med Chem 48: 2270-3 (2005)
Article DOI: 10.1021/jm048978k
BindingDB Entry DOI: 10.7270/Q2M90869
Cytochrome P450 3A4
(Homo sapiens (Human))
BDBM50164240
(6-[5-(4-Fluoro-phenyl)-3H-imidazol-4-yl]-1-(propan...)
Show SMILES CC(C)S(=O)(=O)n1c(N)nc2ccc(cc12)-c1nc[nH]c1-c1ccc(F)cc1
Show InChI InChI=1S/C19H18FN5O2S/c1-11(2)28(26,27)25-16-9-13(5-8-15(16)24-19(25)21)18-17(22-10-23-18)12-3-6-14(20)7-4-12/h3-11H,1-2H3,(H2,21,24)(H,22,23)
Reactome pathway
n/an/a 800n/an/an/an/an/an/a
Eli Lilly and Co.
Curated by ChEMBL
Assay Description
In vitro inhibitory concentration against Cytochrome P450 3A4
J Med Chem 48: 2270-3 (2005)
Article DOI: 10.1021/jm048978k
BindingDB Entry DOI: 10.7270/Q2M90869