BDBM50164507 CHEMBL3798760
SMILES: [H][C@@]12CN(C[C@@]1(NC(=N)N(C)C2=O)c1ccc(Cl)s1)c1nc(CCC)c(F)c(OC)n1
InChI Key: InChIKey=KPZCPKGBTLMHPQ-OVWNDWIMSA-N
Data: 1 KI  1 IC50
Activity Spreadsheet -- Enzyme Inhibition Constant Data from BindingDB
Found 2 hits for monomerid = 50164507
Trg + Lig
Ki
nM
ΔG°
kcal/mole
IC50
nM
Kd
nM
EC50/IC50
nM
koff
s-1
kon
M-1s-1
pHTemp
°C
Beta-secretase 1
(Homo sapiens (Human))
BDBM50164507
(CHEMBL3798760)
Show SMILES [H][C@@]12CN(C[C@@]1(NC(=N)N(C)C2=O)c1ccc(Cl)s1)c1nc(CCC)c(F)c(OC)n1 |r|
Show InChI InChI=1S/C19H22ClFN6O2S/c1-4-5-11-14(21)15(29-3)24-18(23-11)27-8-10-16(28)26(2)17(22)25-19(10,9-27)12-6-7-13(20)30-12/h6-7,10H,4-5,8-9H2,1-3H3,(H2,22,25)/t10-,19-/m0/s1
15n/an/an/an/an/an/an/an/a
Merck Research Laboratories
Curated by ChEMBL
Assay Description
Inhibition of recombinant human BACE1 preincubated for 30 mins followed QSY7EISEVNLDAEFC-Eu-amide substrate addition measured after 90 mins by FRET a...
J Med Chem 59: 3231-48 (2016)
BindingDB Entry DOI: 10.7270/Q2CR5W8V
Beta-secretase 1
(Homo sapiens (Human))
BDBM50164507
(CHEMBL3798760)
Show SMILES [H][C@@]12CN(C[C@@]1(NC(=N)N(C)C2=O)c1ccc(Cl)s1)c1nc(CCC)c(F)c(OC)n1 |r|
Show InChI InChI=1S/C19H22ClFN6O2S/c1-4-5-11-14(21)15(29-3)24-18(23-11)27-8-10-16(28)26(2)17(22)25-19(10,9-27)12-6-7-13(20)30-12/h6-7,10H,4-5,8-9H2,1-3H3,(H2,22,25)/t10-,19-/m0/s1
n/an/a 190n/an/an/an/an/an/a
Merck Research Laboratories
Curated by ChEMBL
Assay Description
Inhibition of BACE1 in human HEK293 cells transfected with human APP Swe/Lon mutations assessed as amyloid beta 40 level after 4 hrs by electrochemil...
J Med Chem 59: 3231-48 (2016)
BindingDB Entry DOI: 10.7270/Q2CR5W8V