BDBM50164671 CHEMBL3798030
SMILES: CCOC(=O)CNC(=O)NCc1cccc(c1)-c1ccncc1N
InChI Key: InChIKey=BMVIHQIQLWPWDF-UHFFFAOYSA-N
Data: 1 KI  1 Kd
PDB links: 1 PDB ID matches this monomer.
Activity Spreadsheet -- Enzyme Inhibition Constant Data from BindingDB
Found 2 hits for monomerid = 50164671
Trg + Lig
Ki
nM
ΔG°
kcal/mole
IC50
nM
Kd
nM
EC50/IC50
nM
koff
s-1
kon
M-1s-1
pHTemp
°C
Peptidyl-prolyl cis-trans isomerase D
(Homo sapiens (Human))
BDBM50164671
(CHEMBL3798030)
Show SMILES CCOC(=O)CNC(=O)NCc1cccc(c1)-c1ccncc1N
Show InChI InChI=1S/C17H20N4O3/c1-2-24-16(22)11-21-17(23)20-9-12-4-3-5-13(8-12)14-6-7-19-10-15(14)18/h3-8,10H,2,9,11,18H2,1H3,(H2,20,21,23)
2.20E+4n/an/an/an/an/an/an/an/a
University of Liverpool
Curated by ChEMBL
Assay Description
Inhibition of Cyclophilin D (unknown origin) activity preincubated for 15 mins followed Suc-AAPF-pNA substrate addition by chymotrypsin coupled based...
J Med Chem 59: 2596-611 (2016)
BindingDB Entry DOI: 10.7270/Q2474CR6
Peptidyl-prolyl cis-trans isomerase D
(Homo sapiens (Human))
BDBM50164671
(CHEMBL3798030)
Show SMILES CCOC(=O)CNC(=O)NCc1cccc(c1)-c1ccncc1N
Show InChI InChI=1S/C17H20N4O3/c1-2-24-16(22)11-21-17(23)20-9-12-4-3-5-13(8-12)14-6-7-19-10-15(14)18/h3-8,10H,2,9,11,18H2,1H3,(H2,20,21,23)
n/an/an/a 9.25E+4n/an/an/an/an/a
University of Liverpool
Curated by ChEMBL
Assay Description
Binding affinity to Cyclophilin D (unknown origin) by isothermal titration calorimetry
J Med Chem 59: 2596-611 (2016)
BindingDB Entry DOI: 10.7270/Q2474CR6