BDBM50164789 CHEMBL3798578
SMILES: CN1CCN(CC1)c1ccc(cc1NC(=O)c1cc(C)c(F)c(C)c1)[N+]([O-])=O
InChI Key: InChIKey=WNRFCVFYUVINJG-UHFFFAOYSA-N
Data: 1 Kd
Activity Spreadsheet -- Enzyme Inhibition Constant Data from BindingDB
Found 1 hit for monomerid = 50164789
Trg + Lig
Ki
nM
ΔG°
kcal/mole
IC50
nM
Kd
nM
EC50/IC50
nM
koff
s-1
kon
M-1s-1
pHTemp
°C
WD repeat-containing protein 5 (WDR5)
(Homo sapiens (Human))
BDBM50164789
(CHEMBL3798578)
Show SMILES CN1CCN(CC1)c1ccc(cc1NC(=O)c1cc(C)c(F)c(C)c1)[N+]([O-])=O
Show InChI InChI=1S/C20H23FN4O3/c1-13-10-15(11-14(2)19(13)21)20(26)22-17-12-16(25(27)28)4-5-18(17)24-8-6-23(3)7-9-24/h4-5,10-12H,6-9H2,1-3H3,(H,22,26)
n/an/an/a 330n/an/an/an/an/a
Ontario Institute for Cancer Research
Curated by ChEMBL
Assay Description
Binding affinity to human poly His-tagged WDR5 (1 to 334 residues) expressed in Escherichia coli BL21(DE3)-V2R-pRARE2 cells by surface plasmon resona...
J Med Chem 59: 2478-96 (2016)
BindingDB Entry DOI: 10.7270/Q2VT1V0C