BDBM50164791 CHEMBL3799704
SMILES: CN1CCN(CC1)c1ccc(cc1NC(=O)c1c[nH]c(=O)cc1C(F)(F)F)[N+]([O-])=O
InChI Key: InChIKey=LXARWAORRXUDTM-UHFFFAOYSA-N
Data: 1 Kd
Activity Spreadsheet -- Enzyme Inhibition Constant Data from BindingDB
Found 1 hit for monomerid = 50164791
Trg + Lig
Ki
nM
ΔG°
kcal/mole
IC50
nM
Kd
nM
EC50/IC50
nM
koff
s-1
kon
M-1s-1
pHTemp
°C
WD repeat-containing protein 5 (WDR5)
(Homo sapiens (Human))
BDBM50164791
(CHEMBL3799704)
Show SMILES CN1CCN(CC1)c1ccc(cc1NC(=O)c1c[nH]c(=O)cc1C(F)(F)F)[N+]([O-])=O
Show InChI InChI=1S/C18H18F3N5O4/c1-24-4-6-25(7-5-24)15-3-2-11(26(29)30)8-14(15)23-17(28)12-10-22-16(27)9-13(12)18(19,20)21/h2-3,8-10H,4-7H2,1H3,(H,22,27)(H,23,28)
n/an/an/a 40n/an/an/an/an/a
Ontario Institute for Cancer Research
Curated by ChEMBL
Assay Description
Binding affinity to human poly His-tagged WDR5 (1 to 334 residues) expressed in Escherichia coli BL21(DE3)-V2R-pRARE2 cells by surface plasmon resona...
J Med Chem 59: 2478-96 (2016)
BindingDB Entry DOI: 10.7270/Q2VT1V0C