BDBM50164821 CHEMBL3798839
SMILES: CCc1cc(cc(C)c1OC[C@@H](O)CNC(=O)CO)-c1noc(n1)-c1cc(OC)nc(c1)C1CCCCC1
InChI Key: InChIKey=MLXDENNTIVBDOY-QFIPXVFZSA-N
Data: 2 EC50
Activity Spreadsheet -- Enzyme Inhibition Constant Data from BindingDB
Found 2 hits for monomerid = 50164821
Trg + Lig
Ki
nM
ΔG°
kcal/mole
IC50
nM
Kd
nM
EC50/IC50
nM
koff
s-1
kon
M-1s-1
pHTemp
°C
Sphingosine 1-phosphate receptor 3
(Homo sapiens (Human))
BDBM50164821
(CHEMBL3798839)
Show SMILES CCc1cc(cc(C)c1OC[C@@H](O)CNC(=O)CO)-c1noc(n1)-c1cc(OC)nc(c1)C1CCCCC1 |r|
Show InChI InChI=1S/C28H36N4O6/c1-4-18-11-20(10-17(2)26(18)37-16-22(34)14-29-24(35)15-33)27-31-28(38-32-27)21-12-23(30-25(13-21)36-3)19-8-6-5-7-9-19/h10-13,19,22,33-34H,4-9,14-16H2,1-3H3,(H,29,35)/t22-/m0/s1
NCI pathway
Reactome pathway
n/an/an/an/a 690n/an/an/an/a
Actelion Pharmaceuticals Ltd.
Curated by ChEMBL
Assay Description
Agonist activity at human recombinant S1PR3 expressed in CHO cell membranes incubated for 30 mins by [35S]GTPgammaS binding assay in presence of GDP
Eur J Med Chem 115: 326-41 (2016)
BindingDB Entry DOI: 10.7270/Q2M90BK2
Sphingosine 1-phosphate receptor 1
(Homo sapiens (Human))
BDBM50164821
(CHEMBL3798839)
Show SMILES CCc1cc(cc(C)c1OC[C@@H](O)CNC(=O)CO)-c1noc(n1)-c1cc(OC)nc(c1)C1CCCCC1 |r|
Show InChI InChI=1S/C28H36N4O6/c1-4-18-11-20(10-17(2)26(18)37-16-22(34)14-29-24(35)15-33)27-31-28(38-32-27)21-12-23(30-25(13-21)36-3)19-8-6-5-7-9-19/h10-13,19,22,33-34H,4-9,14-16H2,1-3H3,(H,29,35)/t22-/m0/s1
Reactome pathway
n/an/an/an/a 7.30n/an/an/an/a
Actelion Pharmaceuticals Ltd.
Curated by ChEMBL
Assay Description
Agonist activity at human recombinant S1PR1 expressed in CHO cell membranes incubated for 30 mins by [35S]GTPgammaS binding assay in presence of GDP
Eur J Med Chem 115: 326-41 (2016)
BindingDB Entry DOI: 10.7270/Q2M90BK2