BDBM50165276 8-(2-Chloro-5-methoxy-phenylsulfanyl)-9-pent-4-ynyl-9H-purin-6-ylamine::CHEMBL192062
SMILES: COc1ccc(Cl)c(Sc2nc3c(N)ncnc3n2CCCC#C)c1
InChI Key: InChIKey=ZODASEFDXYBTCV-UHFFFAOYSA-N
Data: 1 IC50  4 EC50
Activity Spreadsheet -- Enzyme Inhibition Constant Data from BindingDB
Found 5 hits for monomerid = 50165276
Trg + Lig
Ki
nM
ΔG°
kcal/mole
IC50
nM
Kd
nM
EC50/IC50
nM
koff
s-1
kon
M-1s-1
pHTemp
°C
Heat shock protein HSP 90-alpha
(Mus musculus)
BDBM50165276
(8-(2-Chloro-5-methoxy-phenylsulfanyl)-9-pent-4-yny...)
Show SMILES COc1ccc(Cl)c(Sc2nc3c(N)ncnc3n2CCCC#C)c1
Show InChI InChI=1S/C17H16ClN5OS/c1-3-4-5-8-23-16-14(15(19)20-10-21-16)22-17(23)25-13-9-11(24-2)6-7-12(13)18/h1,6-7,9-10H,4-5,8H2,2H3,(H2,19,20,21)
Reactome pathway
n/an/an/an/a 200n/an/an/an/a
Memorial Sloan-Kettering Cancer Center
Curated by ChEMBL
Assay Description
Displacement of 5 nM GM-BODIPY from mouse heat shock protein HSP90-alpha
J Med Chem 48: 2892-905 (2005)
Article DOI: 10.1021/jm049012b
BindingDB Entry DOI: 10.7270/Q2N29WF6
Heat shock protein HSP 90-alpha
(Homo sapiens (Human))
BDBM50165276
(8-(2-Chloro-5-methoxy-phenylsulfanyl)-9-pent-4-yny...)
Show SMILES COc1ccc(Cl)c(Sc2nc3c(N)ncnc3n2CCCC#C)c1
Show InChI InChI=1S/C17H16ClN5OS/c1-3-4-5-8-23-16-14(15(19)20-10-21-16)22-17(23)25-13-9-11(24-2)6-7-12(13)18/h1,6-7,9-10H,4-5,8H2,2H3,(H2,19,20,21)
NCI pathway
Reactome pathway
n/an/an/an/a 9.60E+3n/an/an/an/a
Memorial Sloan-Kettering Cancer Center
Curated by ChEMBL
Assay Description
Effective concentration of compound against heat shock protein HSP90 determined in normal lung cells
J Med Chem 48: 2892-905 (2005)
Article DOI: 10.1021/jm049012b
BindingDB Entry DOI: 10.7270/Q2N29WF6
Heat Shock Protein 90 (Hsp90)
(Homo sapiens (Human))
BDBM50165276
(8-(2-Chloro-5-methoxy-phenylsulfanyl)-9-pent-4-yny...)
Show SMILES COc1ccc(Cl)c(Sc2nc3c(N)ncnc3n2CCCC#C)c1
Show InChI InChI=1S/C17H16ClN5OS/c1-3-4-5-8-23-16-14(15(19)20-10-21-16)22-17(23)25-13-9-11(24-2)6-7-12(13)18/h1,6-7,9-10H,4-5,8H2,2H3,(H2,19,20,21)
Reactome pathway
n/an/a 3.50E+3n/an/an/an/an/an/a
Memorial Sloan-Kettering Cancer Center
Curated by ChEMBL
Assay Description
Inhibition of Hsp90 protein as degradation of HER2 kinase in SKBr3 cells
J Med Chem 48: 2892-905 (2005)
Article DOI: 10.1021/jm049012b
BindingDB Entry DOI: 10.7270/Q2N29WF6
Heat shock protein HSP 90-alpha
(Homo sapiens (Human))
BDBM50165276
(8-(2-Chloro-5-methoxy-phenylsulfanyl)-9-pent-4-yny...)
Show SMILES COc1ccc(Cl)c(Sc2nc3c(N)ncnc3n2CCCC#C)c1
Show InChI InChI=1S/C17H16ClN5OS/c1-3-4-5-8-23-16-14(15(19)20-10-21-16)22-17(23)25-13-9-11(24-2)6-7-12(13)18/h1,6-7,9-10H,4-5,8H2,2H3,(H2,19,20,21)
NCI pathway
Reactome pathway
n/an/an/an/a 1.89E+4n/an/an/an/a
Memorial Sloan-Kettering Cancer Center
Curated by ChEMBL
Assay Description
Effective concentration of compound against heat shock protein HSP90 determined in normal heart cells
J Med Chem 48: 2892-905 (2005)
Article DOI: 10.1021/jm049012b
BindingDB Entry DOI: 10.7270/Q2N29WF6
Heat shock protein HSP 90-alpha
(Homo sapiens (Human))
BDBM50165276
(8-(2-Chloro-5-methoxy-phenylsulfanyl)-9-pent-4-yny...)
Show SMILES COc1ccc(Cl)c(Sc2nc3c(N)ncnc3n2CCCC#C)c1
Show InChI InChI=1S/C17H16ClN5OS/c1-3-4-5-8-23-16-14(15(19)20-10-21-16)22-17(23)25-13-9-11(24-2)6-7-12(13)18/h1,6-7,9-10H,4-5,8H2,2H3,(H2,19,20,21)
NCI pathway
Reactome pathway
n/an/an/an/a 4.49E+4n/an/an/an/a
Memorial Sloan-Kettering Cancer Center
Curated by ChEMBL
Assay Description
Effective concentration of compound against heat shock protein HSP90 determined in normal brain cells
J Med Chem 48: 2892-905 (2005)
Article DOI: 10.1021/jm049012b
BindingDB Entry DOI: 10.7270/Q2N29WF6