BDBM50165361 CHEMBL3798293
SMILES: CCc1cc(cc(C)c1OC[C@@H](O)CNC(=O)CO)-c1noc(n1)-c1ccc(CNC(C)C)s1
InChI Key: InChIKey=BTJJUNZYPIHVBH-SFHVURJKSA-N
Data: 2 EC50
Activity Spreadsheet -- Enzyme Inhibition Constant Data from BindingDB
Found 2 hits for monomerid = 50165361
Trg + Lig
Ki
nM
ΔG°
kcal/mole
IC50
nM
Kd
nM
EC50/IC50
nM
koff
s-1
kon
M-1s-1
pHTemp
°C
Sphingosine 1-phosphate receptor 3
(Homo sapiens (Human))
BDBM50165361
(CHEMBL3798293)
Show SMILES CCc1cc(cc(C)c1OC[C@@H](O)CNC(=O)CO)-c1noc(n1)-c1ccc(CNC(C)C)s1 |r|
Show InChI InChI=1S/C24H32N4O5S/c1-5-16-9-17(8-15(4)22(16)32-13-18(30)10-26-21(31)12-29)23-27-24(33-28-23)20-7-6-19(34-20)11-25-14(2)3/h6-9,14,18,25,29-30H,5,10-13H2,1-4H3,(H,26,31)/t18-/m0/s1
NCI pathway
Reactome pathway
n/an/an/an/a>1.00E+4n/an/an/an/a
Actelion Pharmaceuticals Ltd.
Curated by ChEMBL
Assay Description
Agonist activity at human recombinant S1PR3 expressed in CHO cell membranes assessed as [35S]GTPgammaS binding preincubated for 30 mins followed by [...
Eur J Med Chem 116: 222-238 (2016)
BindingDB Entry DOI: 10.7270/Q2ST7RRN
Sphingosine 1-phosphate receptor 1
(Homo sapiens (Human))
BDBM50165361
(CHEMBL3798293)
Show SMILES CCc1cc(cc(C)c1OC[C@@H](O)CNC(=O)CO)-c1noc(n1)-c1ccc(CNC(C)C)s1 |r|
Show InChI InChI=1S/C24H32N4O5S/c1-5-16-9-17(8-15(4)22(16)32-13-18(30)10-26-21(31)12-29)23-27-24(33-28-23)20-7-6-19(34-20)11-25-14(2)3/h6-9,14,18,25,29-30H,5,10-13H2,1-4H3,(H,26,31)/t18-/m0/s1
Reactome pathway
n/an/an/an/a 203n/an/an/an/a
Actelion Pharmaceuticals Ltd.
Curated by ChEMBL
Assay Description
Agonist activity at human recombinant S1PR1 expressed in CHO cell membranes assessed as [35S]GTPgammaS binding preincubated for 30 mins followed by [...
Eur J Med Chem 116: 222-238 (2016)
BindingDB Entry DOI: 10.7270/Q2ST7RRN