BDBM50165364 CHEMBL3800430
SMILES: CCc1cc(cc(C)c1OC[C@@H](O)CNC(=O)CO)-c1noc(n1)-c1cc(C)c(CNCC(C)C)s1
InChI Key: InChIKey=SPUDJSAJYSSDNC-FQEVSTJZSA-N
Data: 2 EC50
Activity Spreadsheet -- Enzyme Inhibition Constant Data from BindingDB
Found 2 hits for monomerid = 50165364
Trg + Lig
Ki
nM
ΔG°
kcal/mole
IC50
nM
Kd
nM
EC50/IC50
nM
koff
s-1
kon
M-1s-1
pHTemp
°C
Sphingosine 1-phosphate receptor 3
(Homo sapiens (Human))
BDBM50165364
(CHEMBL3800430)
Show SMILES CCc1cc(cc(C)c1OC[C@@H](O)CNC(=O)CO)-c1noc(n1)-c1cc(C)c(CNCC(C)C)s1 |r|
Show InChI InChI=1S/C26H36N4O5S/c1-6-18-9-19(7-17(5)24(18)34-14-20(32)11-28-23(33)13-31)25-29-26(35-30-25)21-8-16(4)22(36-21)12-27-10-15(2)3/h7-9,15,20,27,31-32H,6,10-14H2,1-5H3,(H,28,33)/t20-/m0/s1
NCI pathway
Reactome pathway
n/an/an/an/a 1.40E+3n/an/an/an/a
Actelion Pharmaceuticals Ltd.
Curated by ChEMBL
Assay Description
Agonist activity at human recombinant S1PR3 expressed in CHO cell membranes assessed as [35S]GTPgammaS binding preincubated for 30 mins followed by [...
Eur J Med Chem 116: 222-238 (2016)
BindingDB Entry DOI: 10.7270/Q2ST7RRN
Sphingosine 1-phosphate receptor 1
(Homo sapiens (Human))
BDBM50165364
(CHEMBL3800430)
Show SMILES CCc1cc(cc(C)c1OC[C@@H](O)CNC(=O)CO)-c1noc(n1)-c1cc(C)c(CNCC(C)C)s1 |r|
Show InChI InChI=1S/C26H36N4O5S/c1-6-18-9-19(7-17(5)24(18)34-14-20(32)11-28-23(33)13-31)25-29-26(35-30-25)21-8-16(4)22(36-21)12-27-10-15(2)3/h7-9,15,20,27,31-32H,6,10-14H2,1-5H3,(H,28,33)/t20-/m0/s1
Reactome pathway
n/an/an/an/a 20n/an/an/an/a
Actelion Pharmaceuticals Ltd.
Curated by ChEMBL
Assay Description
Agonist activity at human recombinant S1PR1 expressed in CHO cell membranes assessed as [35S]GTPgammaS binding preincubated for 30 mins followed by [...
Eur J Med Chem 116: 222-238 (2016)
BindingDB Entry DOI: 10.7270/Q2ST7RRN