null
SMILES: CCN(CC)Cc1ccc(cc1C)-c1nc(no1)-c1cc(C)c(OC[C@@H](O)CNC(=O)CO)c(CC)c1
InChI Key: InChIKey=TUJQHFUOUKEZIG-DEOSSOPVSA-N
Activity Spreadsheet -- Enzyme Inhibition Constant Data from BindingDB
Found 2 hits for monomerid = 50165387
Trg + Lig
Ki
nM
ΔG°
kcal/mole
IC50
nM
Kd
nM
EC50/IC50
nM
koff
s-1
kon
M-1s-1
pHTemp
°C
Sphingosine 1-phosphate receptor 3
(Homo sapiens (Human))
BDBM50165387
(CHEMBL3797436)
Show SMILES CCN(CC)Cc1ccc(cc1C)-c1nc(no1)-c1cc(C)c(OC[C@@H](O)CNC(=O)CO)c(CC)c1 |r|
Show InChI InChI=1S/C28H38N4O5/c1-6-20-13-23(12-19(5)26(20)36-17-24(34)14-29-25(35)16-33)27-30-28(37-31-27)21-9-10-22(18(4)11-21)15-32(7-2)8-3/h9-13,24,33-34H,6-8,14-17H2,1-5H3,(H,29,35)/t24-/m0/s1
NCI pathway
Reactome pathway
n/an/an/an/a 560n/an/an/an/a
Actelion Pharmaceuticals Ltd.
Curated by ChEMBL
Assay Description
Agonist activity at human recombinant S1PR3 expressed in CHO cell membranes assessed as [35S]GTPgammaS binding preincubated for 30 mins followed by [...
Eur J Med Chem 116: 222-238 (2016)
BindingDB Entry DOI: 10.7270/Q2ST7RRN
Sphingosine 1-phosphate receptor 1
(Homo sapiens (Human))
BDBM50165387
(CHEMBL3797436)
Show SMILES CCN(CC)Cc1ccc(cc1C)-c1nc(no1)-c1cc(C)c(OC[C@@H](O)CNC(=O)CO)c(CC)c1 |r|
Show InChI InChI=1S/C28H38N4O5/c1-6-20-13-23(12-19(5)26(20)36-17-24(34)14-29-25(35)16-33)27-30-28(37-31-27)21-9-10-22(18(4)11-21)15-32(7-2)8-3/h9-13,24,33-34H,6-8,14-17H2,1-5H3,(H,29,35)/t24-/m0/s1
Reactome pathway
n/an/an/an/a 10n/an/an/an/a
Actelion Pharmaceuticals Ltd.
Curated by ChEMBL
Assay Description
Agonist activity at human recombinant S1PR1 expressed in CHO cell membranes assessed as [35S]GTPgammaS binding preincubated for 30 mins followed by [...
Eur J Med Chem 116: 222-238 (2016)
BindingDB Entry DOI: 10.7270/Q2ST7RRN