BDBM50165405 CHEMBL3799888
SMILES: CCc1cc(CN(C)CC(C)C)cc(c1)-c1nc(no1)-c1cc(C)c(OC[C@@H](O)CNC(=O)CO)c(CC)c1
InChI Key: InChIKey=KHSWQSGTWGVPLE-SANMLTNESA-N
Data: 2 EC50
Activity Spreadsheet -- Enzyme Inhibition Constant Data from BindingDB
Found 2 hits for monomerid = 50165405
Trg + Lig
Ki
nM
ΔG°
kcal/mole
IC50
nM
Kd
nM
EC50/IC50
nM
koff
s-1
kon
M-1s-1
pHTemp
°C
Sphingosine 1-phosphate receptor 3
(Homo sapiens (Human))
BDBM50165405
(CHEMBL3799888)
Show SMILES CCc1cc(CN(C)CC(C)C)cc(c1)-c1nc(no1)-c1cc(C)c(OC[C@@H](O)CNC(=O)CO)c(CC)c1 |r|
Show InChI InChI=1S/C30H42N4O5/c1-7-21-10-22(16-34(6)15-19(3)4)12-25(11-21)30-32-29(33-39-30)24-9-20(5)28(23(8-2)13-24)38-18-26(36)14-31-27(37)17-35/h9-13,19,26,35-36H,7-8,14-18H2,1-6H3,(H,31,37)/t26-/m0/s1
NCI pathway
Reactome pathway
n/an/an/an/a 8n/an/an/an/a
Actelion Pharmaceuticals Ltd.
Curated by ChEMBL
Assay Description
Agonist activity at human recombinant S1PR3 expressed in CHO cell membranes assessed as [35S]GTPgammaS binding preincubated for 30 mins followed by [...
Eur J Med Chem 116: 222-238 (2016)
BindingDB Entry DOI: 10.7270/Q2ST7RRN
Sphingosine 1-phosphate receptor 1
(Homo sapiens (Human))
BDBM50165405
(CHEMBL3799888)
Show SMILES CCc1cc(CN(C)CC(C)C)cc(c1)-c1nc(no1)-c1cc(C)c(OC[C@@H](O)CNC(=O)CO)c(CC)c1 |r|
Show InChI InChI=1S/C30H42N4O5/c1-7-21-10-22(16-34(6)15-19(3)4)12-25(11-21)30-32-29(33-39-30)24-9-20(5)28(23(8-2)13-24)38-18-26(36)14-31-27(37)17-35/h9-13,19,26,35-36H,7-8,14-18H2,1-6H3,(H,31,37)/t26-/m0/s1
Reactome pathway
n/an/an/an/a 1.10n/an/an/an/a
Actelion Pharmaceuticals Ltd.
Curated by ChEMBL
Assay Description
Agonist activity at human recombinant S1PR1 expressed in CHO cell membranes assessed as [35S]GTPgammaS binding preincubated for 30 mins followed by [...
Eur J Med Chem 116: 222-238 (2016)
BindingDB Entry DOI: 10.7270/Q2ST7RRN