BDBM50165433 CHEMBL3799493
SMILES: CCN(CC)Cc1cc(cc(C)n1)-c1nc(no1)-c1cc(C)c(OC[C@@H](O)CNC(=O)CO)c(CC)c1
InChI Key: InChIKey=SSFFVKQYCZFLJP-QHCPKHFHSA-N
Data: 2 EC50
Activity Spreadsheet -- Enzyme Inhibition Constant Data from BindingDB
Found 2 hits for monomerid = 50165433
Trg + Lig
Ki
nM
ΔG°
kcal/mole
IC50
nM
Kd
nM
EC50/IC50
nM
koff
s-1
kon
M-1s-1
pHTemp
°C
Sphingosine 1-phosphate receptor 3
(Homo sapiens (Human))
BDBM50165433
(CHEMBL3799493)
Show SMILES CCN(CC)Cc1cc(cc(C)n1)-c1nc(no1)-c1cc(C)c(OC[C@@H](O)CNC(=O)CO)c(CC)c1 |r|
Show InChI InChI=1S/C27H37N5O5/c1-6-19-11-20(9-17(4)25(19)36-16-23(34)13-28-24(35)15-33)26-30-27(37-31-26)21-10-18(5)29-22(12-21)14-32(7-2)8-3/h9-12,23,33-34H,6-8,13-16H2,1-5H3,(H,28,35)/t23-/m0/s1
NCI pathway
Reactome pathway
n/an/an/an/a 8.10E+3n/an/an/an/a
Actelion Pharmaceuticals Ltd.
Curated by ChEMBL
Assay Description
Agonist activity at human recombinant S1PR3 expressed in CHO cell membranes assessed as [35S]GTPgammaS binding preincubated for 30 mins followed by [...
Eur J Med Chem 116: 222-238 (2016)
BindingDB Entry DOI: 10.7270/Q2ST7RRN
Sphingosine 1-phosphate receptor 1
(Homo sapiens (Human))
BDBM50165433
(CHEMBL3799493)
Show SMILES CCN(CC)Cc1cc(cc(C)n1)-c1nc(no1)-c1cc(C)c(OC[C@@H](O)CNC(=O)CO)c(CC)c1 |r|
Show InChI InChI=1S/C27H37N5O5/c1-6-19-11-20(9-17(4)25(19)36-16-23(34)13-28-24(35)15-33)26-30-27(37-31-26)21-10-18(5)29-22(12-21)14-32(7-2)8-3/h9-12,23,33-34H,6-8,13-16H2,1-5H3,(H,28,35)/t23-/m0/s1
Reactome pathway
n/an/an/an/a 45n/an/an/an/a
Actelion Pharmaceuticals Ltd.
Curated by ChEMBL
Assay Description
Agonist activity at human recombinant S1PR1 expressed in CHO cell membranes assessed as [35S]GTPgammaS binding preincubated for 30 mins followed by [...
Eur J Med Chem 116: 222-238 (2016)
BindingDB Entry DOI: 10.7270/Q2ST7RRN