null
SMILES: CCc1cc(cc(C)c1OC[C@@H](O)CNC(=O)CO)-c1noc(n1)-c1sc(CN(C)C)c(C)c1C
InChI Key: InChIKey=QXVLOMBLUKAKCO-IBGZPJMESA-N
Activity Spreadsheet -- Enzyme Inhibition Constant Data from BindingDB
Found 2 hits for monomerid = 50165462
Trg + Lig
Ki
nM
ΔG°
kcal/mole
IC50
nM
Kd
nM
EC50/IC50
nM
koff
s-1
kon
M-1s-1
pHTemp
°C
Sphingosine 1-phosphate receptor 3
(Homo sapiens (Human))
BDBM50165462
(CHEMBL3800102)
Show SMILES CCc1cc(cc(C)c1OC[C@@H](O)CNC(=O)CO)-c1noc(n1)-c1sc(CN(C)C)c(C)c1C |r|
Show InChI InChI=1S/C25H34N4O5S/c1-7-17-9-18(8-14(2)22(17)33-13-19(31)10-26-21(32)12-30)24-27-25(34-28-24)23-16(4)15(3)20(35-23)11-29(5)6/h8-9,19,30-31H,7,10-13H2,1-6H3,(H,26,32)/t19-/m0/s1
NCI pathway
Reactome pathway
n/an/an/an/a 4.40E+3n/an/an/an/a
Actelion Pharmaceuticals Ltd.
Curated by ChEMBL
Assay Description
Agonist activity at human recombinant S1PR3 expressed in CHO cell membranes assessed as [35S]GTPgammaS binding preincubated for 30 mins followed by [...
Eur J Med Chem 116: 222-238 (2016)
BindingDB Entry DOI: 10.7270/Q2ST7RRN
Sphingosine 1-phosphate receptor 1
(Homo sapiens (Human))
BDBM50165462
(CHEMBL3800102)
Show SMILES CCc1cc(cc(C)c1OC[C@@H](O)CNC(=O)CO)-c1noc(n1)-c1sc(CN(C)C)c(C)c1C |r|
Show InChI InChI=1S/C25H34N4O5S/c1-7-17-9-18(8-14(2)22(17)33-13-19(31)10-26-21(32)12-30)24-27-25(34-28-24)23-16(4)15(3)20(35-23)11-29(5)6/h8-9,19,30-31H,7,10-13H2,1-6H3,(H,26,32)/t19-/m0/s1
Reactome pathway
n/an/an/an/a 6.40n/an/an/an/a
Actelion Pharmaceuticals Ltd.
Curated by ChEMBL
Assay Description
Agonist activity at human recombinant S1PR1 expressed in CHO cell membranes assessed as [35S]GTPgammaS binding preincubated for 30 mins followed by [...
Eur J Med Chem 116: 222-238 (2016)
BindingDB Entry DOI: 10.7270/Q2ST7RRN