BDBM50165484 1-(2-methoxy-5-((4-oxo-3,4-dihydrophthalazin-1-yl)methyl)phenyl)pyrrolidine-2,5-dione::1-[2-Methoxy-5-(4-oxo-3,4-dihydro-phthalazin-1-ylmethyl)-phenyl]-pyrrolidine-2,5-dione::CHEMBL371205
SMILES: COc1ccc(Cc2n[nH]c(=O)c3ccccc23)cc1-n1c(O)ccc1O
InChI Key: InChIKey=XERQVOBYFUPWCB-UHFFFAOYSA-N
Data: 2 IC50
Activity Spreadsheet -- Enzyme Inhibition Constant Data from BindingDB
Found 2 hits for monomerid = 50165484
Trg + Lig
Ki
nM
ΔG°
kcal/mole
IC50
nM
Kd
nM
EC50/IC50
nM
koff
s-1
kon
M-1s-1
pHTemp
°C
Poly [ADP-ribose] polymerase 1
(Homo sapiens (Human))
BDBM50165484
(1-(2-methoxy-5-((4-oxo-3,4-dihydrophthalazin-1-yl)...)
Show SMILES COc1ccc(Cc2n[nH]c(=O)c3ccccc23)cc1-n1c(O)ccc1O |(-3.66,1.78,;-4.47,.48,;-3.75,-.88,;-2.22,-.93,;-1.48,-2.29,;-2.3,-3.61,;-1.58,-4.97,;-.04,-5.02,;.68,-6.38,;2.21,-6.44,;3.03,-5.13,;4.57,-5.19,;2.31,-3.77,;3.13,-2.47,;2.41,-1.1,;.86,-1.05,;.05,-2.35,;.77,-3.71,;-3.85,-3.55,;-4.57,-2.19,;-6.11,-2.13,;-7.06,-3.34,;-6.64,-4.82,;-8.51,-2.81,;-8.45,-1.27,;-6.97,-.85,;-6.44,.6,)|
Show InChI InChI=1S/C20H17N3O4/c1-27-17-7-6-12(11-16(17)23-18(24)8-9-19(23)25)10-15-13-4-2-3-5-14(13)20(26)22-21-15/h2-9,11,24-25H,10H2,1H3,(H,22,26)
n/an/a 33n/an/an/an/an/an/a
Huazhong University of Science and Technology
Curated by ChEMBL
Assay Description
Inhibition of human recombinant PARP1
J Med Chem 52: 718-25 (2009)
Article DOI: 10.1021/jm800902t
BindingDB Entry DOI: 10.7270/Q2C53KPW
Poly [ADP-ribose] polymerase 1
(Homo sapiens (Human))
BDBM50165484
(1-(2-methoxy-5-((4-oxo-3,4-dihydrophthalazin-1-yl)...)
Show SMILES COc1ccc(Cc2n[nH]c(=O)c3ccccc23)cc1-n1c(O)ccc1O |(-3.66,1.78,;-4.47,.48,;-3.75,-.88,;-2.22,-.93,;-1.48,-2.29,;-2.3,-3.61,;-1.58,-4.97,;-.04,-5.02,;.68,-6.38,;2.21,-6.44,;3.03,-5.13,;4.57,-5.19,;2.31,-3.77,;3.13,-2.47,;2.41,-1.1,;.86,-1.05,;.05,-2.35,;.77,-3.71,;-3.85,-3.55,;-4.57,-2.19,;-6.11,-2.13,;-7.06,-3.34,;-6.64,-4.82,;-8.51,-2.81,;-8.45,-1.27,;-6.97,-.85,;-6.44,.6,)|
Show InChI InChI=1S/C20H17N3O4/c1-27-17-7-6-12(11-16(17)23-18(24)8-9-19(23)25)10-15-13-4-2-3-5-14(13)20(26)22-21-15/h2-9,11,24-25H,10H2,1H3,(H,22,26)
n/an/a 33n/an/an/an/an/an/a
KuDOS Horsham Ltd
Curated by ChEMBL
Assay Description
Inhibitory concentration against human poly (ADP-ribose) polymerase 1 (PARP-1)
Bioorg Med Chem Lett 15: 2235-8 (2005)
Article DOI: 10.1016/j.bmcl.2005.03.026
BindingDB Entry DOI: 10.7270/Q2QV3M0B