BDBM50165521 6-(3-tert-Butyl-ureido)-2-(2-methoxy-5-nitro-benzylsulfanyl)-3-propyl-3H-benzoimidazole-4-carboxylic acid (pyridin-2-ylmethyl)-amide::CHEMBL197089
SMILES: CCCn1c(SCc2cc(ccc2OC)[N+]([O-])=O)nc2cc(NC(=O)NC(C)(C)C)cc(C(=O)NCc3ccccn3)c12
InChI Key: InChIKey=ZDNRCQPSSFQWRK-UHFFFAOYSA-N
Data: 2 IC50
Activity Spreadsheet -- Enzyme Inhibition Constant Data from BindingDB
Found 2 hits for monomerid = 50165521
Trg + Lig
Ki
nM
ΔG°
kcal/mole
IC50
nM
Kd
nM
EC50/IC50
nM
koff
s-1
kon
M-1s-1
pHTemp
°C
Gonadotropin releasing hormone 1 (GnRHR1)
(Homo sapiens (Human))
BDBM50165521
(6-(3-tert-Butyl-ureido)-2-(2-methoxy-5-nitro-benzy...)
Show SMILES CCCn1c(SCc2cc(ccc2OC)[N+]([O-])=O)nc2cc(NC(=O)NC(C)(C)C)cc(C(=O)NCc3ccccn3)c12
Show InChI InChI=1S/C30H35N7O5S/c1-6-13-36-26-23(27(38)32-17-20-9-7-8-12-31-20)15-21(33-28(39)35-30(2,3)4)16-24(26)34-29(36)43-18-19-14-22(37(40)41)10-11-25(19)42-5/h7-12,14-16H,6,13,17-18H2,1-5H3,(H,32,38)(H2,33,35,39)
n/an/a 31n/an/an/an/an/an/a
Kyoto 619-0216
Curated by ChEMBL
Assay Description
Inhibitory concentration against human leutinizing releasing hormone receptor
Bioorg Med Chem Lett 15: 2265-9 (2005)
Article DOI: 10.1016/j.bmcl.2005.03.030
BindingDB Entry DOI: 10.7270/Q2GB23K1
Gonadotropin-releasing hormone receptor
(Rattus norvegicus)
BDBM50165521
(6-(3-tert-Butyl-ureido)-2-(2-methoxy-5-nitro-benzy...)
Show SMILES CCCn1c(SCc2cc(ccc2OC)[N+]([O-])=O)nc2cc(NC(=O)NC(C)(C)C)cc(C(=O)NCc3ccccn3)c12
Show InChI InChI=1S/C30H35N7O5S/c1-6-13-36-26-23(27(38)32-17-20-9-7-8-12-31-20)15-21(33-28(39)35-30(2,3)4)16-24(26)34-29(36)43-18-19-14-22(37(40)41)10-11-25(19)42-5/h7-12,14-16H,6,13,17-18H2,1-5H3,(H,32,38)(H2,33,35,39)
n/an/a 51n/an/an/an/an/an/a
Kyoto 619-0216
Curated by ChEMBL
Assay Description
Inhibitory concentration against rat leutinizing releasing hormone receptor
Bioorg Med Chem Lett 15: 2265-9 (2005)
Article DOI: 10.1016/j.bmcl.2005.03.030
BindingDB Entry DOI: 10.7270/Q2GB23K1