BDBM50165621 (2-{2-Chloro-4-[3-((E)-2,4-dichloro-phenyl)-acryloylamino]-phenyl}-benzooxazol-5-yl)-acetic acid::CHEMBL196662
SMILES: OC(=O)Cc1ccc2oc(nc2c1)-c1ccc(NC(=O)\C=C\c2ccc(Cl)cc2Cl)cc1Cl
InChI Key: InChIKey=PLMGYZYIYRRZDT-FPYGCLRLSA-N
Data: 1 IC50
Activity Spreadsheet -- Enzyme Inhibition Constant Data from BindingDB
Found 1 hit for monomerid = 50165621
Trg + Lig
Ki
nM
ΔG°
kcal/mole
IC50
nM
Kd
nM
EC50/IC50
nM
koff
s-1
kon
M-1s-1
pHTemp
°C
Heparanase
(Homo sapiens (Human))
BDBM50165621
((2-{2-Chloro-4-[3-((E)-2,4-dichloro-phenyl)-acrylo...)
Show SMILES OC(=O)Cc1ccc2oc(nc2c1)-c1ccc(NC(=O)\C=C\c2ccc(Cl)cc2Cl)cc1Cl
Show InChI InChI=1S/C24H15Cl3N2O4/c25-15-4-2-14(18(26)11-15)3-8-22(30)28-16-5-6-17(19(27)12-16)24-29-20-9-13(10-23(31)32)1-7-21(20)33-24/h1-9,11-12H,10H2,(H,28,30)(H,31,32)/b8-3+
n/an/a 350n/an/an/an/an/an/a
Celltech R&D Ltd
Curated by ChEMBL
Assay Description
In vitro inhibitory concentration against human Heparanase
Bioorg Med Chem Lett 15: 2295-9 (2005)
Article DOI: 10.1016/j.bmcl.2005.03.014
BindingDB Entry DOI: 10.7270/Q2BP029G