BDBM50165663 (2-{4-[2-(4-Bromo-phenylcarbamoyl)-vinyl]-2-fluoro-phenyl}-benzooxazol-5-yl)-acetic acid::2-(2-(4-(3-(4-bromophenylamino)-3-oxoprop-1-enyl)-2-fluorophenyl)benzo[d]oxazol-5-yl)acetic acid::CHEMBL194231
SMILES: OC(=O)Cc1ccc2oc(nc2c1)-c1ccc(\C=C\C(=O)Nc2ccc(Br)cc2)cc1F
InChI Key: InChIKey=WDGARPIRBPYNJF-XCVCLJGOSA-N
Data: 2 IC50
Activity Spreadsheet -- Enzyme Inhibition Constant Data from BindingDB
Found 2 hits for monomerid = 50165663
Trg + Lig
Ki
nM
ΔG°
kcal/mole
IC50
nM
Kd
nM
EC50/IC50
nM
koff
s-1
kon
M-1s-1
pHTemp
°C
Heparanase
(Homo sapiens (Human))
BDBM50165663
((2-{4-[2-(4-Bromo-phenylcarbamoyl)-vinyl]-2-fluoro...)
Show SMILES OC(=O)Cc1ccc2oc(nc2c1)-c1ccc(\C=C\C(=O)Nc2ccc(Br)cc2)cc1F
Show InChI InChI=1S/C24H16BrFN2O4/c25-16-4-6-17(7-5-16)27-22(29)10-3-14-1-8-18(19(26)11-14)24-28-20-12-15(13-23(30)31)2-9-21(20)32-24/h1-12H,13H2,(H,27,29)(H,30,31)/b10-3+
n/an/a 398n/an/an/an/an/an/a
Sharif University of Technology
Curated by ChEMBL
Assay Description
Inhibition of heparanase
Eur J Med Chem 43: 548-56 (2008)
Article DOI: 10.1016/j.ejmech.2007.04.014
BindingDB Entry DOI: 10.7270/Q2PC33KM
Heparanase
(Homo sapiens (Human))
BDBM50165663
((2-{4-[2-(4-Bromo-phenylcarbamoyl)-vinyl]-2-fluoro...)
Show SMILES OC(=O)Cc1ccc2oc(nc2c1)-c1ccc(\C=C\C(=O)Nc2ccc(Br)cc2)cc1F
Show InChI InChI=1S/C24H16BrFN2O4/c25-16-4-6-17(7-5-16)27-22(29)10-3-14-1-8-18(19(26)11-14)24-28-20-12-15(13-23(30)31)2-9-21(20)32-24/h1-12H,13H2,(H,27,29)(H,30,31)/b10-3+
n/an/a 400n/an/an/an/an/an/a
Celltech R&D Ltd
Curated by ChEMBL
Assay Description
In vitro inhibitory concentration against human Heparanase
Bioorg Med Chem Lett 15: 2295-9 (2005)
Article DOI: 10.1016/j.bmcl.2005.03.014
BindingDB Entry DOI: 10.7270/Q2BP029G