BDBM50165726 CHEMBL3797962
SMILES: CCC[C@H]1N(CCC[C@@]1(Oc1ccc(cc1)C(F)(F)F)C(=O)N1CCC(CC1)Oc1cccc(Cl)c1)C(=O)c1cnccc1C(F)(F)F
InChI Key: InChIKey=WQZGKKKJIJFFOK-SVZMEOIVSA-N
Data: 1 IC50
Activity Spreadsheet -- Enzyme Inhibition Constant Data from BindingDB
Found 1 hit for monomerid = 50165726
Trg + Lig
Ki
nM
ΔG°
kcal/mole
IC50
nM
Kd
nM
EC50/IC50
nM
koff
s-1
kon
M-1s-1
pHTemp
°C
E3 ubiquitin-protein ligase Mdm2
(Homo sapiens (Human))
BDBM50165726
(CHEMBL3797962)
Show SMILES CCC[C@H]1N(CCC[C@@]1(Oc1ccc(cc1)C(F)(F)F)C(=O)N1CCC(CC1)Oc1cccc(Cl)c1)C(=O)c1cnccc1C(F)(F)F |r|
Show InChI InChI=1S/C6H12O6/c7-1-2-3(8)4(9)5(10)6(11)12-2/h2-11H,1H2/t2-,3+,4+,5-,6?/m1/s1
NCI pathway
Reactome pathway
n/an/a 2.10E+3n/an/an/an/an/an/a
Merck Research Laboratories
Curated by ChEMBL
Assay Description
Binding affinity to human MDM2 assessed as inhibition of interaction with p53 by fluorescence polarization assay
Bioorg Med Chem Lett 26: 2735-8 (2016)
Article DOI: 10.1016/j.bmcl.2016.03.078
BindingDB Entry DOI: 10.7270/Q28S4RTD