BDBM50165938 Ac-YCit[CEHdFRWC]-NH2::CHEMBL412494
SMILES: CC(=O)N[C@@H](Cc1ccc(O)cc1)C(=O)N[C@@H](CCCNC(N)=O)C(=O)N[C@@H]1CSSC[C@@H](NC(=O)[C@@H](Cc2c[nH]c3ccccc23)NC(=O)[C@H](CCCNC(N)=N)NC(=O)[C@H](Cc2ccccc2)NC(=O)[C@H](Cc2cnc[nH]2)NC(=O)[C@@H](CCC(O)=O)NC1=O)C(N)=O
InChI Key: InChIKey=OODHJMPCOPKKSM-XVRHLUALSA-N
Data: 4 KI  1 EC50
Activity Spreadsheet -- Enzyme Inhibition Constant Data from BindingDB
Found 5 hits for monomerid = 50165938
Trg + Lig
Ki
nM
ΔG°
kcal/mole
IC50
nM
Kd
nM
EC50/IC50
nM
koff
s-1
kon
M-1s-1
pHTemp
°C
Melanocortin receptor 4
(Homo sapiens (Human))
BDBM50165938
(Ac-YCit[CEHdFRWC]-NH2 | CHEMBL412494)
Show SMILES CC(=O)N[C@@H](Cc1ccc(O)cc1)C(=O)N[C@@H](CCCNC(N)=O)C(=O)N[C@@H]1CSSC[C@@H](NC(=O)[C@@H](Cc2c[nH]c3ccccc23)NC(=O)[C@H](CCCNC(N)=N)NC(=O)[C@H](Cc2ccccc2)NC(=O)[C@H](Cc2cnc[nH]2)NC(=O)[C@@H](CCC(O)=O)NC1=O)C(N)=O
Show InChI InChI=1S/C60H78N18O14S2/c1-32(79)70-43(24-34-15-17-37(80)18-16-34)54(87)71-41(14-8-22-67-60(64)92)52(85)78-48-30-94-93-29-47(50(61)83)77-56(89)45(25-35-27-68-39-12-6-5-11-38(35)39)75-51(84)40(13-7-21-66-59(62)63)72-55(88)44(23-33-9-3-2-4-10-33)74-57(90)46(26-36-28-65-31-69-36)76-53(86)42(73-58(48)91)19-20-49(81)82/h2-6,9-12,15-18,27-28,31,40-48,68,80H,7-8,13-14,19-26,29-30H2,1H3,(H2,61,83)(H,65,69)(H,70,79)(H,71,87)(H,72,88)(H,73,91)(H,74,90)(H,75,84)(H,76,86)(H,77,89)(H,78,85)(H,81,82)(H4,62,63,66)(H3,64,67,92)/t40-,41-,42+,43-,44-,45+,46-,47+,48+/m0/s1
2.5n/an/an/an/an/an/an/an/a
Lilly Research Laboratories
Curated by ChEMBL
Assay Description
Inhibition of [125I]-NDP-alpha-MSH binding to melanocortin-4 receptor expressed in HEK293 cells
J Med Chem 48: 3095-8 (2005)
Article DOI: 10.1021/jm0501432
BindingDB Entry DOI: 10.7270/Q2251HQZ
Melanocyte-stimulating hormone receptor
(Homo sapiens (Human))
BDBM50165938
(Ac-YCit[CEHdFRWC]-NH2 | CHEMBL412494)
Show SMILES CC(=O)N[C@@H](Cc1ccc(O)cc1)C(=O)N[C@@H](CCCNC(N)=O)C(=O)N[C@@H]1CSSC[C@@H](NC(=O)[C@@H](Cc2c[nH]c3ccccc23)NC(=O)[C@H](CCCNC(N)=N)NC(=O)[C@H](Cc2ccccc2)NC(=O)[C@H](Cc2cnc[nH]2)NC(=O)[C@@H](CCC(O)=O)NC1=O)C(N)=O
Show InChI InChI=1S/C60H78N18O14S2/c1-32(79)70-43(24-34-15-17-37(80)18-16-34)54(87)71-41(14-8-22-67-60(64)92)52(85)78-48-30-94-93-29-47(50(61)83)77-56(89)45(25-35-27-68-39-12-6-5-11-38(35)39)75-51(84)40(13-7-21-66-59(62)63)72-55(88)44(23-33-9-3-2-4-10-33)74-57(90)46(26-36-28-65-31-69-36)76-53(86)42(73-58(48)91)19-20-49(81)82/h2-6,9-12,15-18,27-28,31,40-48,68,80H,7-8,13-14,19-26,29-30H2,1H3,(H2,61,83)(H,65,69)(H,70,79)(H,71,87)(H,72,88)(H,73,91)(H,74,90)(H,75,84)(H,76,86)(H,77,89)(H,78,85)(H,81,82)(H4,62,63,66)(H3,64,67,92)/t40-,41-,42+,43-,44-,45+,46-,47+,48+/m0/s1
49n/an/an/an/an/an/an/an/a
Lilly Research Laboratories
Curated by ChEMBL
Assay Description
Inhibition of [125I]NDP-alpha-MSH binding to melanocortin-1 receptor expressed in HEK293 cells
J Med Chem 48: 3095-8 (2005)
Article DOI: 10.1021/jm0501432
BindingDB Entry DOI: 10.7270/Q2251HQZ
Melanocortin receptor 3
(Homo sapiens (Human))
BDBM50165938
(Ac-YCit[CEHdFRWC]-NH2 | CHEMBL412494)
Show SMILES CC(=O)N[C@@H](Cc1ccc(O)cc1)C(=O)N[C@@H](CCCNC(N)=O)C(=O)N[C@@H]1CSSC[C@@H](NC(=O)[C@@H](Cc2c[nH]c3ccccc23)NC(=O)[C@H](CCCNC(N)=N)NC(=O)[C@H](Cc2ccccc2)NC(=O)[C@H](Cc2cnc[nH]2)NC(=O)[C@@H](CCC(O)=O)NC1=O)C(N)=O
Show InChI InChI=1S/C60H78N18O14S2/c1-32(79)70-43(24-34-15-17-37(80)18-16-34)54(87)71-41(14-8-22-67-60(64)92)52(85)78-48-30-94-93-29-47(50(61)83)77-56(89)45(25-35-27-68-39-12-6-5-11-38(35)39)75-51(84)40(13-7-21-66-59(62)63)72-55(88)44(23-33-9-3-2-4-10-33)74-57(90)46(26-36-28-65-31-69-36)76-53(86)42(73-58(48)91)19-20-49(81)82/h2-6,9-12,15-18,27-28,31,40-48,68,80H,7-8,13-14,19-26,29-30H2,1H3,(H2,61,83)(H,65,69)(H,70,79)(H,71,87)(H,72,88)(H,73,91)(H,74,90)(H,75,84)(H,76,86)(H,77,89)(H,78,85)(H,81,82)(H4,62,63,66)(H3,64,67,92)/t40-,41-,42+,43-,44-,45+,46-,47+,48+/m0/s1
313n/an/an/an/an/an/an/an/a
Lilly Research Laboratories
Curated by ChEMBL
Assay Description
Inhibition of [125I]-NDP-alpha-MSH binding to melanocortin-3 receptor expressed in HEK293 cells
J Med Chem 48: 3095-8 (2005)
Article DOI: 10.1021/jm0501432
BindingDB Entry DOI: 10.7270/Q2251HQZ
Melanocortin receptor 5 (MC5R)
(Homo sapiens (Human))
BDBM50165938
(Ac-YCit[CEHdFRWC]-NH2 | CHEMBL412494)
Show SMILES CC(=O)N[C@@H](Cc1ccc(O)cc1)C(=O)N[C@@H](CCCNC(N)=O)C(=O)N[C@@H]1CSSC[C@@H](NC(=O)[C@@H](Cc2c[nH]c3ccccc23)NC(=O)[C@H](CCCNC(N)=N)NC(=O)[C@H](Cc2ccccc2)NC(=O)[C@H](Cc2cnc[nH]2)NC(=O)[C@@H](CCC(O)=O)NC1=O)C(N)=O
Show InChI InChI=1S/C60H78N18O14S2/c1-32(79)70-43(24-34-15-17-37(80)18-16-34)54(87)71-41(14-8-22-67-60(64)92)52(85)78-48-30-94-93-29-47(50(61)83)77-56(89)45(25-35-27-68-39-12-6-5-11-38(35)39)75-51(84)40(13-7-21-66-59(62)63)72-55(88)44(23-33-9-3-2-4-10-33)74-57(90)46(26-36-28-65-31-69-36)76-53(86)42(73-58(48)91)19-20-49(81)82/h2-6,9-12,15-18,27-28,31,40-48,68,80H,7-8,13-14,19-26,29-30H2,1H3,(H2,61,83)(H,65,69)(H,70,79)(H,71,87)(H,72,88)(H,73,91)(H,74,90)(H,75,84)(H,76,86)(H,77,89)(H,78,85)(H,81,82)(H4,62,63,66)(H3,64,67,92)/t40-,41-,42+,43-,44-,45+,46-,47+,48+/m0/s1
>500n/an/an/an/an/an/an/an/a
Lilly Research Laboratories
Curated by ChEMBL
Assay Description
Inhibition of [125I]NDP-alpha-MSH binding to melanocortin-5 receptor expressed in HEK293 cells
J Med Chem 48: 3095-8 (2005)
Article DOI: 10.1021/jm0501432
BindingDB Entry DOI: 10.7270/Q2251HQZ
Melanocortin receptor 4
(Homo sapiens (Human))
BDBM50165938
(Ac-YCit[CEHdFRWC]-NH2 | CHEMBL412494)
Show SMILES CC(=O)N[C@@H](Cc1ccc(O)cc1)C(=O)N[C@@H](CCCNC(N)=O)C(=O)N[C@@H]1CSSC[C@@H](NC(=O)[C@@H](Cc2c[nH]c3ccccc23)NC(=O)[C@H](CCCNC(N)=N)NC(=O)[C@H](Cc2ccccc2)NC(=O)[C@H](Cc2cnc[nH]2)NC(=O)[C@@H](CCC(O)=O)NC1=O)C(N)=O
Show InChI InChI=1S/C60H78N18O14S2/c1-32(79)70-43(24-34-15-17-37(80)18-16-34)54(87)71-41(14-8-22-67-60(64)92)52(85)78-48-30-94-93-29-47(50(61)83)77-56(89)45(25-35-27-68-39-12-6-5-11-38(35)39)75-51(84)40(13-7-21-66-59(62)63)72-55(88)44(23-33-9-3-2-4-10-33)74-57(90)46(26-36-28-65-31-69-36)76-53(86)42(73-58(48)91)19-20-49(81)82/h2-6,9-12,15-18,27-28,31,40-48,68,80H,7-8,13-14,19-26,29-30H2,1H3,(H2,61,83)(H,65,69)(H,70,79)(H,71,87)(H,72,88)(H,73,91)(H,74,90)(H,75,84)(H,76,86)(H,77,89)(H,78,85)(H,81,82)(H4,62,63,66)(H3,64,67,92)/t40-,41-,42+,43-,44-,45+,46-,47+,48+/m0/s1
n/an/an/an/a 0.790n/an/an/an/a
Lilly Research Laboratories
Curated by ChEMBL
Assay Description
Agonist activity at human Melanocortin-4 receptor as peptide required for 50% maximal cAMP release (n > or =2)
J Med Chem 48: 3095-8 (2005)
Article DOI: 10.1021/jm0501432
BindingDB Entry DOI: 10.7270/Q2251HQZ