BDBM50166126 CHEMBL265236::Hexadecanoic acid [(S)-1-((R)-1-{(S)-1-[(S)-1-carbamoyl-2-(1H-indol-3-yl)-ethylcarbamoyl]-4-guanidino-butylcarbamoyl}-2-phenyl-ethylcarbamoyl)-2-(3H-imidazol-4-yl)-ethyl]-amide
SMILES: CCCCCCCCCCCCCCCC(=O)N[C@@H](Cc1cnc[nH]1)C(=O)N[C@H](Cc1ccccc1)C(=O)N[C@@H](CCCNC(N)=N)C(=O)N[C@@H](Cc1c[nH]c2ccccc12)C(N)=O
InChI Key: InChIKey=FTHMBGYIBAGPMD-GFUJKPJOSA-N
Data: 4 EC50
Activity Spreadsheet -- Enzyme Inhibition Constant Data from BindingDB
Found 4 hits for monomerid = 50166126
Trg + Lig
Ki
nM
ΔG°
kcal/mole
IC50
nM
Kd
nM
EC50/IC50
nM
koff
s-1
kon
M-1s-1
pHTemp
°C
Melanocortin receptor 4
(Mus musculus)
BDBM50166126
(CHEMBL265236 | Hexadecanoic acid [(S)-1-((R)-1-{(S...)
Show SMILES CCCCCCCCCCCCCCCC(=O)N[C@@H](Cc1cnc[nH]1)C(=O)N[C@H](Cc1ccccc1)C(=O)N[C@@H](CCCNC(N)=N)C(=O)N[C@@H](Cc1c[nH]c2ccccc12)C(N)=O
Show InChI InChI=1S/C48H71N11O5/c1-2-3-4-5-6-7-8-9-10-11-12-13-17-26-43(60)56-42(30-36-32-52-33-55-36)47(64)59-41(28-34-21-15-14-16-22-34)46(63)57-39(25-20-27-53-48(50)51)45(62)58-40(44(49)61)29-35-31-54-38-24-19-18-23-37(35)38/h14-16,18-19,21-24,31-33,39-42,54H,2-13,17,20,25-30H2,1H3,(H2,49,61)(H,52,55)(H,56,60)(H,57,63)(H,58,62)(H,59,64)(H4,50,51,53)/t39-,40-,41+,42-/m0/s1
n/an/an/an/a 26.6n/an/an/an/a
University of Florida
Curated by ChEMBL
Assay Description
In vitro agonist potency for Mouse Melanocortin 4 receptor
J Med Chem 48: 3328-36 (2005)
Article DOI: 10.1021/jm0490843
BindingDB Entry DOI: 10.7270/Q29K4C0B
Melanocortin receptor 3
(Mus musculus)
BDBM50166126
(CHEMBL265236 | Hexadecanoic acid [(S)-1-((R)-1-{(S...)
Show SMILES CCCCCCCCCCCCCCCC(=O)N[C@@H](Cc1cnc[nH]1)C(=O)N[C@H](Cc1ccccc1)C(=O)N[C@@H](CCCNC(N)=N)C(=O)N[C@@H](Cc1c[nH]c2ccccc12)C(N)=O
Show InChI InChI=1S/C48H71N11O5/c1-2-3-4-5-6-7-8-9-10-11-12-13-17-26-43(60)56-42(30-36-32-52-33-55-36)47(64)59-41(28-34-21-15-14-16-22-34)46(63)57-39(25-20-27-53-48(50)51)45(62)58-40(44(49)61)29-35-31-54-38-24-19-18-23-37(35)38/h14-16,18-19,21-24,31-33,39-42,54H,2-13,17,20,25-30H2,1H3,(H2,49,61)(H,52,55)(H,56,60)(H,57,63)(H,58,62)(H,59,64)(H4,50,51,53)/t39-,40-,41+,42-/m0/s1
Reactome pathway
n/an/an/an/a 154n/an/an/an/a
University of Florida
Curated by ChEMBL
Assay Description
In vitro agonist potency for Mouse Melanocortin 3 receptor
J Med Chem 48: 3328-36 (2005)
Article DOI: 10.1021/jm0490843
BindingDB Entry DOI: 10.7270/Q29K4C0B
Melanocortin receptor 5 (MC5R)
(Mus musculus (Mouse))
BDBM50166126
(CHEMBL265236 | Hexadecanoic acid [(S)-1-((R)-1-{(S...)
Show SMILES CCCCCCCCCCCCCCCC(=O)N[C@@H](Cc1cnc[nH]1)C(=O)N[C@H](Cc1ccccc1)C(=O)N[C@@H](CCCNC(N)=N)C(=O)N[C@@H](Cc1c[nH]c2ccccc12)C(N)=O
Show InChI InChI=1S/C48H71N11O5/c1-2-3-4-5-6-7-8-9-10-11-12-13-17-26-43(60)56-42(30-36-32-52-33-55-36)47(64)59-41(28-34-21-15-14-16-22-34)46(63)57-39(25-20-27-53-48(50)51)45(62)58-40(44(49)61)29-35-31-54-38-24-19-18-23-37(35)38/h14-16,18-19,21-24,31-33,39-42,54H,2-13,17,20,25-30H2,1H3,(H2,49,61)(H,52,55)(H,56,60)(H,57,63)(H,58,62)(H,59,64)(H4,50,51,53)/t39-,40-,41+,42-/m0/s1
n/an/an/an/a 2.99n/an/an/an/a
University of Florida
Curated by ChEMBL
Assay Description
In vitro agonist potency for Mouse Melanocortin 5 receptor
J Med Chem 48: 3328-36 (2005)
Article DOI: 10.1021/jm0490843
BindingDB Entry DOI: 10.7270/Q29K4C0B
Melanocortin receptor 1
(Mus musculus)
BDBM50166126
(CHEMBL265236 | Hexadecanoic acid [(S)-1-((R)-1-{(S...)
Show SMILES CCCCCCCCCCCCCCCC(=O)N[C@@H](Cc1cnc[nH]1)C(=O)N[C@H](Cc1ccccc1)C(=O)N[C@@H](CCCNC(N)=N)C(=O)N[C@@H](Cc1c[nH]c2ccccc12)C(N)=O
Show InChI InChI=1S/C48H71N11O5/c1-2-3-4-5-6-7-8-9-10-11-12-13-17-26-43(60)56-42(30-36-32-52-33-55-36)47(64)59-41(28-34-21-15-14-16-22-34)46(63)57-39(25-20-27-53-48(50)51)45(62)58-40(44(49)61)29-35-31-54-38-24-19-18-23-37(35)38/h14-16,18-19,21-24,31-33,39-42,54H,2-13,17,20,25-30H2,1H3,(H2,49,61)(H,52,55)(H,56,60)(H,57,63)(H,58,62)(H,59,64)(H4,50,51,53)/t39-,40-,41+,42-/m0/s1
n/an/an/an/a 0.990n/an/an/an/a
University of Florida
Curated by ChEMBL
Assay Description
In vitro agonist potency for Mouse Melanocortin 1 receptor
J Med Chem 48: 3328-36 (2005)
Article DOI: 10.1021/jm0490843
BindingDB Entry DOI: 10.7270/Q29K4C0B