BDBM50166156 (E)-N-Hydroxy-3-{4-[3-(2-methoxy-phenyl)-3-oxo-propenyl]-1-methyl-1H-pyrrol-2-yl}-acrylamide::CHEMBL192870::N-hydroxy-3-(4-(3-(2-methoxyphenyl)-3-oxoprop-1-enyl)-1-methyl-1H-pyrrol-2-yl)acrylamide
SMILES: COc1ccccc1C(=O)\C=C\c1cc(\C=C\C(=O)NO)n(C)c1
InChI Key: InChIKey=GMDLUFKQPDBUPT-FIFLTTCUSA-N
Data: 2 IC50
Activity Spreadsheet -- Enzyme Inhibition Constant Data from BindingDB
Found 2 hits for monomerid = 50166156
Trg + Lig
Ki
nM
ΔG°
kcal/mole
IC50
nM
Kd
nM
EC50/IC50
nM
koff
s-1
kon
M-1s-1
pHTemp
°C
Histone deacetylase HD2
(Zea mays)
BDBM50166156
((E)-N-Hydroxy-3-{4-[3-(2-methoxy-phenyl)-3-oxo-pro...)
Show SMILES COc1ccccc1C(=O)\C=C\c1cc(\C=C\C(=O)NO)n(C)c1
Show InChI InChI=1S/C18H18N2O4/c1-20-12-13(11-14(20)8-10-18(22)19-23)7-9-16(21)15-5-3-4-6-17(15)24-2/h3-12,23H,1-2H3,(H,19,22)/b9-7+,10-8+
n/an/a 250n/an/an/an/an/an/a
Universit£ degli Studi di Roma"La Sapienza"
Curated by ChEMBL
Assay Description
Inhibitory concentration against maize histone deacetylase 2
J Med Chem 48: 3344-53 (2005)
Article DOI: 10.1021/jm049002a
BindingDB Entry DOI: 10.7270/Q2222VKN
Histone deacetylase HD1B
(Zea mays)
BDBM50166156
((E)-N-Hydroxy-3-{4-[3-(2-methoxy-phenyl)-3-oxo-pro...)
Show SMILES COc1ccccc1C(=O)\C=C\c1cc(\C=C\C(=O)NO)n(C)c1
Show InChI InChI=1S/C18H18N2O4/c1-20-12-13(11-14(20)8-10-18(22)19-23)7-9-16(21)15-5-3-4-6-17(15)24-2/h3-12,23H,1-2H3,(H,19,22)/b9-7+,10-8+
n/an/a 170n/an/an/an/an/an/a
Università degli Studi di Roma La Sapienza
Curated by ChEMBL
Assay Description
Inhibition of maize histone deacetylase 1B
Eur J Med Chem 43: 621-32 (2008)
Article DOI: 10.1016/j.ejmech.2007.05.004
BindingDB Entry DOI: 10.7270/Q28K78V4