BDBM50166169 (E)-3-{4-[3-(2-Fluoro-phenyl)-3-oxo-propenyl]-1-methyl-1H-pyrrol-2-yl}-N-hydroxy-acrylamide::3-(4-(3-(2-fluorophenyl)-3-oxoprop-1-enyl)-1-methyl-1H-pyrrol-2-yl)-N-hydroxyacrylamide::CHEMBL371806
SMILES: Cn1cc(\C=C\C(=O)c2ccccc2F)cc1\C=C\C(=O)NO
InChI Key: InChIKey=JGQDWDDTPAAXBN-CDJQDVQCSA-N
Data: 2 IC50
Activity Spreadsheet -- Enzyme Inhibition Constant Data from BindingDB
Found 2 hits for monomerid = 50166169
Trg + Lig
Ki
nM
ΔG°
kcal/mole
IC50
nM
Kd
nM
EC50/IC50
nM
koff
s-1
kon
M-1s-1
pHTemp
°C
Histone deacetylase HD2
(Zea mays)
BDBM50166169
((E)-3-{4-[3-(2-Fluoro-phenyl)-3-oxo-propenyl]-1-me...)
Show SMILES Cn1cc(\C=C\C(=O)c2ccccc2F)cc1\C=C\C(=O)NO
Show InChI InChI=1S/C17H15FN2O3/c1-20-11-12(10-13(20)7-9-17(22)19-23)6-8-16(21)14-4-2-3-5-15(14)18/h2-11,23H,1H3,(H,19,22)/b8-6+,9-7+
n/an/a 7.10E+3n/an/an/an/an/an/a
Universit£ degli Studi di Roma"La Sapienza"
Curated by ChEMBL
Assay Description
Inhibitory concentration against maize histone deacetylase 2
J Med Chem 48: 3344-53 (2005)
Article DOI: 10.1021/jm049002a
BindingDB Entry DOI: 10.7270/Q2222VKN
Histone deacetylase HD1B
(Zea mays)
BDBM50166169
((E)-3-{4-[3-(2-Fluoro-phenyl)-3-oxo-propenyl]-1-me...)
Show SMILES Cn1cc(\C=C\C(=O)c2ccccc2F)cc1\C=C\C(=O)NO
Show InChI InChI=1S/C17H15FN2O3/c1-20-11-12(10-13(20)7-9-17(22)19-23)6-8-16(21)14-4-2-3-5-15(14)18/h2-11,23H,1H3,(H,19,22)/b8-6+,9-7+
n/an/a 3.40E+3n/an/an/an/an/an/a
Università degli Studi di Roma La Sapienza
Curated by ChEMBL
Assay Description
Inhibition of maize histone deacetylase 1B
Eur J Med Chem 43: 621-32 (2008)
Article DOI: 10.1016/j.ejmech.2007.05.004
BindingDB Entry DOI: 10.7270/Q28K78V4