BDBM50166409 CHEMBL3797587
SMILES:
InChI Key: InChIKey=WYMDRUQTDACYEF-UHFFFAOYSA-N
Data: 2 IC50
Activity Spreadsheet -- Enzyme Inhibition Constant Data from BindingDB
Found 2 hits for monomerid = 50166409
Trg + Lig
Ki
nM
ΔG°
kcal/mole
IC50
nM
Kd
nM
EC50/IC50
nM
koff
s-1
kon
M-1s-1
pHTemp
°C
Mitogen-activated protein kinase 1
(Homo sapiens (Human))
BDBM50166409
(CHEMBL3797587)
Show InChI InChI=1S/C21H17ClN4O/c1-13(16-4-2-3-5-18(16)22)24-21(27)15-6-7-19-17(12-15)20(26-25-19)14-8-10-23-11-9-14/h2-13H,1H3,(H,24,27)(H,25,26)
NCI pathway
Reactome pathway
n/an/a 17n/an/an/an/an/an/a
Green Valley Research Institute
Curated by ChEMBL
Assay Description
Inhibition of human recombinant GST-tagged ERK2 expressed in Escherichia coli using ser/thr 3 Peptide as substrate preincubated for 1 hr measured aft...
Bioorg Med Chem Lett 26: 2600-4 (2016)
Article DOI: 10.1016/j.bmcl.2016.04.029
BindingDB Entry DOI: 10.7270/Q2H99731
Mitogen-activated protein kinase 3
(Homo sapiens (Human))
BDBM50166409
(CHEMBL3797587)
Show InChI InChI=1S/C21H17ClN4O/c1-13(16-4-2-3-5-18(16)22)24-21(27)15-6-7-19-17(12-15)20(26-25-19)14-8-10-23-11-9-14/h2-13H,1H3,(H,24,27)(H,25,26)
Reactome pathway
n/an/a 36n/an/an/an/an/an/a
Green Valley Research Institute
Curated by ChEMBL
Assay Description
Inhibition of human recombinant GST-tagged ERK1 expressed in Escherichia coli using ser/thr 3 Peptide as substrate preincubated for 1 hr measured aft...
Bioorg Med Chem Lett 26: 2600-4 (2016)
Article DOI: 10.1016/j.bmcl.2016.04.029
BindingDB Entry DOI: 10.7270/Q2H99731