BDBM50166482 1,2-Bis-(4-chloro-phenyl)-4-heptyl-pyrazolidine-3,5-dione::CHEMBL440384
SMILES: CCCCCCCc1c(O)n(-c2ccc(Cl)cc2)n(-c2ccc(Cl)cc2)c1=O
InChI Key: InChIKey=FEQRZIOIFJTNCD-UHFFFAOYSA-N
Data: 2 IC50
Activity Spreadsheet -- Enzyme Inhibition Constant Data from BindingDB
Found 2 hits for monomerid = 50166482
Trg + Lig
Ki
nM
ΔG°
kcal/mole
IC50
nM
Kd
nM
EC50/IC50
nM
koff
s-1
kon
M-1s-1
pHTemp
°C
MurB (E. coli)
(Escherichia coli K-12 (Enterobacteria))
BDBM50166482
(1,2-Bis-(4-chloro-phenyl)-4-heptyl-pyrazolidine-3,...)
Show SMILES CCCCCCCc1c(O)n(-c2ccc(Cl)cc2)n(-c2ccc(Cl)cc2)c1=O
Show InChI InChI=1S/C22H24Cl2N2O2/c1-2-3-4-5-6-7-20-21(27)25(18-12-8-16(23)9-13-18)26(22(20)28)19-14-10-17(24)11-15-19/h8-15,27H,2-7H2,1H3
n/an/a 4.20E+4n/an/an/an/an/an/a
Wyeth Research
Curated by ChEMBL
Assay Description
Inhibitory concentration against MurB enzyme in Escherichia coli
Bioorg Med Chem Lett 15: 2527-31 (2005)
Article DOI: 10.1016/j.bmcl.2005.03.058
BindingDB Entry DOI: 10.7270/Q2BG2NHW
MurA (E. coli)
(Escherichia coli K-12 (Enterobacteria))
BDBM50166482
(1,2-Bis-(4-chloro-phenyl)-4-heptyl-pyrazolidine-3,...)
Show SMILES CCCCCCCc1c(O)n(-c2ccc(Cl)cc2)n(-c2ccc(Cl)cc2)c1=O
Show InChI InChI=1S/C22H24Cl2N2O2/c1-2-3-4-5-6-7-20-21(27)25(18-12-8-16(23)9-13-18)26(22(20)28)19-14-10-17(24)11-15-19/h8-15,27H,2-7H2,1H3
n/an/a>5.00E+4n/an/an/an/an/an/a
Wyeth Research
Curated by ChEMBL
Assay Description
Inhibitory concentration against MurA enzyme in Escherichia coli
Bioorg Med Chem Lett 15: 2527-31 (2005)
Article DOI: 10.1016/j.bmcl.2005.03.058
BindingDB Entry DOI: 10.7270/Q2BG2NHW