BDBM50166507 2-(2-Hydroxy-phenyl)-3-phenethyl-4a,5,6,7,8,8a-hexahydro-3H-quinazolin-4-one::CHEMBL369998
SMILES: Oc1ccccc1C1=NC2CCCCC2C(=O)N1CCc1ccccc1
InChI Key: InChIKey=CVVOQWRQKUEKTG-UHFFFAOYSA-N
Data: 1 IC50
Activity Spreadsheet -- Enzyme Inhibition Constant Data from BindingDB
Found 1 hit for monomerid = 50166507
Trg + Lig
Ki
nM
ΔG°
kcal/mole
IC50
nM
Kd
nM
EC50/IC50
nM
koff
s-1
kon
M-1s-1
pHTemp
°C
Calcium-sensing receptor (CaSR)
(Homo sapiens (Human))
BDBM50166507
(2-(2-Hydroxy-phenyl)-3-phenethyl-4a,5,6,7,8,8a-hex...)
Show SMILES Oc1ccccc1C1=NC2CCCCC2C(=O)N1CCc1ccccc1 |t:8|
Show InChI InChI=1S/C22H24N2O2/c25-20-13-7-5-11-18(20)21-23-19-12-6-4-10-17(19)22(26)24(21)15-14-16-8-2-1-3-9-16/h1-3,5,7-9,11,13,17,19,25H,4,6,10,12,14-15H2
n/an/a 140n/an/an/an/an/an/a
NPS Pharmaceuticals, Inc.
Curated by ChEMBL
Assay Description
Inhibitory concentration was evaluated for in vitro calcilytic activity against human calcium receptor
Bioorg Med Chem Lett 15: 2537-40 (2005)
Article DOI: 10.1016/j.bmcl.2005.03.054
BindingDB Entry DOI: 10.7270/Q26Q1WRQ