BDBM50166577 CHEMBL3797362
SMILES: CCn1ncc2ccc(cc12)C(=O)Nc1nnc(s1)C1CC1
InChI Key: InChIKey=KWDCFGRMRIZGMV-UHFFFAOYSA-N
Data: 1 KI  1 IC50
Activity Spreadsheet -- Enzyme Inhibition Constant Data from BindingDB
Found 2 hits for monomerid = 50166577
Trg + Lig
Ki
nM
ΔG°
kcal/mole
IC50
nM
Kd
nM
EC50/IC50
nM
koff
s-1
kon
M-1s-1
pHTemp
°C
Prostaglandin E2 receptor
(Homo sapiens (Human))
BDBM50166577
(CHEMBL3797362)
Show SMILES CCn1ncc2ccc(cc12)C(=O)Nc1nnc(s1)C1CC1
Show InChI InChI=1S/C15H15N5OS/c1-2-20-12-7-10(5-6-11(12)8-16-20)13(21)17-15-19-18-14(22-15)9-3-4-9/h5-9H,2-4H2,1H3,(H,17,19,21)
310n/an/an/an/an/an/an/an/a
Pfizer Inc.
Curated by ChEMBL
Assay Description
Displacement of [3H]PGE2 from human recombinant EP3 receptor expressed in human Chem1 cell membrane by scintillation proximity assay
Bioorg Med Chem Lett 26: 2670-5 (2016)
Article DOI: 10.1016/j.bmcl.2016.04.009
BindingDB Entry DOI: 10.7270/Q2CJ8GDR
Prostaglandin E2 receptor
(Homo sapiens (Human))
BDBM50166577
(CHEMBL3797362)
Show SMILES CCn1ncc2ccc(cc12)C(=O)Nc1nnc(s1)C1CC1
Show InChI InChI=1S/C15H15N5OS/c1-2-20-12-7-10(5-6-11(12)8-16-20)13(21)17-15-19-18-14(22-15)9-3-4-9/h5-9H,2-4H2,1H3,(H,17,19,21)
n/an/a 362n/an/an/an/an/an/a
Pfizer Inc.
Curated by ChEMBL
Assay Description
Antagonist activity at human recombinant EP3 receptor expressed in CHOK1 cells assessed as inhibition of sulprostone-induced decrease in cAMP level p...
Bioorg Med Chem Lett 26: 2670-5 (2016)
Article DOI: 10.1016/j.bmcl.2016.04.009
BindingDB Entry DOI: 10.7270/Q2CJ8GDR