BDBM50166598 CHEMBL3799237
SMILES: CCN1c2cc(ccc2C(=O)NC1(C)C)-c1c(C)n[nH]c1C
InChI Key: InChIKey=DUTODZZHAPKLHS-UHFFFAOYSA-N
Data: 1 IC50
Activity Spreadsheet -- Enzyme Inhibition Constant Data from BindingDB
Found 1 hit for monomerid = 50166598
Trg + Lig
Ki
nM
ΔG°
kcal/mole
IC50
nM
Kd
nM
EC50/IC50
nM
koff
s-1
kon
M-1s-1
pHTemp
°C
Protein kinase C theta type
(Homo sapiens (Human))
BDBM50166598
(CHEMBL3799237)
Show SMILES CCN1c2cc(ccc2C(=O)NC1(C)C)-c1c(C)n[nH]c1C
Show InChI InChI=1S/C17H22N4O/c1-6-21-14-9-12(15-10(2)19-20-11(15)3)7-8-13(14)16(22)18-17(21,4)5/h7-9H,6H2,1-5H3,(H,18,22)(H,19,20)
NCI pathway
Reactome pathway
n/an/a 1.90E+3n/an/an/an/an/an/a
Takeda Pharmaceutical Company, Ltd
Curated by ChEMBL
Assay Description
Inhibition of N-terminal FLAG-tagged PKCtheta (unknown origin) expressed in baculovirus preincubated for 5 mins using fluorescein-PKC substrate measu...
Bioorg Med Chem 24: 2466-75 (2016)
Article DOI: 10.1016/j.bmc.2016.04.008
BindingDB Entry DOI: 10.7270/Q27W6F29