BDBM50166775 CHEMBL3797238
SMILES: COc1cc(CCc2cc(Nc3ncnc4c(OC)cccc34)n[nH]2)cc(OC)c1
InChI Key: InChIKey=KBEJCSPRYFMBJJ-UHFFFAOYSA-N
Data: 2 IC50
Activity Spreadsheet -- Enzyme Inhibition Constant Data from BindingDB
Found 2 hits for monomerid = 50166775
Trg + Lig
Ki
nM
ΔG°
kcal/mole
IC50
nM
Kd
nM
EC50/IC50
nM
koff
s-1
kon
M-1s-1
pHTemp
°C
Fibroblast growth factor receptor 2
(Homo sapiens (Human))
BDBM50166775
(CHEMBL3797238)
Show SMILES COc1cc(CCc2cc(Nc3ncnc4c(OC)cccc34)n[nH]2)cc(OC)c1
Show InChI InChI=1S/C13H17NO3/c15-11-7-6-10(12(16)13(11)17)14-8-9-4-2-1-3-5-9/h1-7,10-17H,8H2
NCI pathway
Reactome pathway
n/an/a>200n/an/an/an/an/an/a
Chinese Academy of Sciences (CAS)
Curated by ChEMBL
Assay Description
Inhibition of recombinant FGFR2 in human SNU16 cells assessed as suppression of cell proliferation after 72 hrs by SRB/CCK-8 assay
Bioorg Med Chem Lett 26: 2594-9 (2016)
Article DOI: 10.1016/j.bmcl.2016.04.028
BindingDB Entry DOI: 10.7270/Q20C4XNM
Fibroblast growth factor receptor 2
(Homo sapiens (Human))
BDBM50166775
(CHEMBL3797238)
Show SMILES COc1cc(CCc2cc(Nc3ncnc4c(OC)cccc34)n[nH]2)cc(OC)c1
Show InChI InChI=1S/C13H17NO3/c15-11-7-6-10(12(16)13(11)17)14-8-9-4-2-1-3-5-9/h1-7,10-17H,8H2
NCI pathway
Reactome pathway
n/an/a 3.90n/an/an/an/an/an/a
Chinese Academy of Sciences (CAS)
Curated by ChEMBL
Assay Description
Inhibition of recombinant FGFR2 (unknown origin) using (Glu,Tyr)4:1 as substrate incubated for 60 mins by ELISA
Bioorg Med Chem Lett 26: 2594-9 (2016)
Article DOI: 10.1016/j.bmcl.2016.04.028
BindingDB Entry DOI: 10.7270/Q20C4XNM