BDBM50167538 CHEMBL3799331
SMILES: N[C@@H](Cc1ccc(cc1)C(=O)\N=C(/N)NCc1cc(ccc1N1CCCCC1)-c1nccs1)C(O)=O
InChI Key: InChIKey=MGSDXKPTVNLQBE-NRFANRHFSA-N
Data: 1 IC50
Activity Spreadsheet -- Enzyme Inhibition Constant Data from BindingDB
Found 1 hit for monomerid = 50167538
Trg + Lig
Ki
nM
ΔG°
kcal/mole
IC50
nM
Kd
nM
EC50/IC50
nM
koff
s-1
kon
M-1s-1
pHTemp
°C
Tryptophan 5-hydroxylase 1
(Homo sapiens (Human))
BDBM50167538
(CHEMBL3799331)
Show SMILES N[C@@H](Cc1ccc(cc1)C(=O)\N=C(/N)NCc1cc(ccc1N1CCCCC1)-c1nccs1)C(O)=O |r|
Show InChI InChI=1S/C26H30N6O3S/c27-21(25(34)35)14-17-4-6-18(7-5-17)23(33)31-26(28)30-16-20-15-19(24-29-10-13-36-24)8-9-22(20)32-11-2-1-3-12-32/h4-10,13,15,21H,1-3,11-12,14,16,27H2,(H,34,35)(H3,28,30,31,33)/t21-/m0/s1
Reactome pathway
n/an/a 7n/an/an/an/an/an/a
Karos Pharmaceuticals
Curated by ChEMBL
Assay Description
Inhibition of TPH1 (unknown origin)
Bioorg Med Chem Lett 26: 2855-2860 (2016)
Article DOI: 10.1016/j.bmcl.2016.04.057
BindingDB Entry DOI: 10.7270/Q2SN0BW3