BDBM50167611 (2R,5R)-1-[4-(2-Chloro-4-fluoro-benzyloxy)-benzenesulfonyl]-5-hydroxy-3,3-dimethyl-piperidine-2-carboxylic acid hydroxyamide::CHEMBL372878
SMILES: CC1(C)C[C@@H](O)CN([C@H]1C(=O)NO)S(=O)(=O)c1ccc(OCc2ccc(F)cc2Cl)cc1
InChI Key: InChIKey=CWBVJJZJNOSACP-BEFAXECRSA-N
Data: 2 IC50
Activity Spreadsheet -- Enzyme Inhibition Constant Data from BindingDB
Found 2 hits for monomerid = 50167611
Trg + Lig
Ki
nM
ΔG°
kcal/mole
IC50
nM
Kd
nM
EC50/IC50
nM
koff
s-1
kon
M-1s-1
pHTemp
°C
Collagenase 3
(Homo sapiens (Human))
BDBM50167611
((2R,5R)-1-[4-(2-Chloro-4-fluoro-benzyloxy)-benzene...)
Show SMILES CC1(C)C[C@@H](O)CN([C@H]1C(=O)NO)S(=O)(=O)c1ccc(OCc2ccc(F)cc2Cl)cc1
Show InChI InChI=1S/C21H24ClFN2O6S/c1-21(2)10-15(26)11-25(19(21)20(27)24-28)32(29,30)17-7-5-16(6-8-17)31-12-13-3-4-14(23)9-18(13)22/h3-9,15,19,26,28H,10-12H2,1-2H3,(H,24,27)/t15-,19+/m1/s1
NCI pathway
Reactome pathway
n/an/a 0.5n/an/an/an/an/an/a
Pfizer Global Research and Development Groton Laboratories
Curated by ChEMBL
Assay Description
Inhibitory concentration against Matrix metalloproteinase-13 (MMP-13)
Bioorg Med Chem Lett 15: 2808-11 (2005)
Article DOI: 10.1016/j.bmcl.2005.03.105
BindingDB Entry DOI: 10.7270/Q2BC3Z24
Interstitial collagenase
(Homo sapiens (Human))
BDBM50167611
((2R,5R)-1-[4-(2-Chloro-4-fluoro-benzyloxy)-benzene...)
Show SMILES CC1(C)C[C@@H](O)CN([C@H]1C(=O)NO)S(=O)(=O)c1ccc(OCc2ccc(F)cc2Cl)cc1
Show InChI InChI=1S/C21H24ClFN2O6S/c1-21(2)10-15(26)11-25(19(21)20(27)24-28)32(29,30)17-7-5-16(6-8-17)31-12-13-3-4-14(23)9-18(13)22/h3-9,15,19,26,28H,10-12H2,1-2H3,(H,24,27)/t15-,19+/m1/s1
Reactome pathway
n/an/a 592n/an/an/an/an/an/a
Pfizer Global Research and Development Groton Laboratories
Curated by ChEMBL
Assay Description
Inhibitory concentration against Matrix metalloproteinase-1 (MMP-1)
Bioorg Med Chem Lett 15: 2808-11 (2005)
Article DOI: 10.1016/j.bmcl.2005.03.105
BindingDB Entry DOI: 10.7270/Q2BC3Z24