BDBM50167833 3-amino-N-[(2R)-butan-2-yl]-5-(1-{[({4-carbamimidoyl-2-[(pyridin-4-yl)carbamoyl]phenyl}methyl)carbamoyl]methyl}-6-oxo-5-(propan-2-ylamino)-1,6-dihydropyrazin-2-yl)benzamide::5-[AMINO(IMINO)METHYL]-2-[({[6-[3-AMINO-5-({[(1R)-1-METHYLPROPYL]AMINO}CARBONYL)PHENYL]-3-(ISOPROPYLAMINO)-2-OXOPYRAZIN-1(2H)-YL]ACETYL}AMINO)METHYL]-N-PYRIDIN-4-YLBENZAMIDE::CHEMBL372240
SMILES: CC[C@@H](C)NC(=O)c1cc(N)cc(c1)-c1cnc(NC(C)C)c(=O)n1CC(=O)NCc1ccc(cc1C(=O)Nc1ccncc1)C(N)=N
InChI Key: InChIKey=HLQIVSDFLBJBKY-HXUWFJFHSA-N
Data: 1 IC50
PDB links: 1 PDB ID matches this monomer.
Activity Spreadsheet -- Enzyme Inhibition Constant Data from BindingDB
Found 1 hit for monomerid = 50167833
Trg + Lig
Ki
nM
ΔG°
kcal/mole
IC50
nM
Kd
nM
EC50/IC50
nM
koff
s-1
kon
M-1s-1
pHTemp
°C
Coagulation factor VII
(Homo sapiens (Human))
BDBM50167833
(3-amino-N-[(2R)-butan-2-yl]-5-(1-{[({4-carbamimido...)
Show SMILES CC[C@@H](C)NC(=O)c1cc(N)cc(c1)-c1cnc(NC(C)C)c(=O)n1CC(=O)NCc1ccc(cc1C(=O)Nc1ccncc1)C(N)=N
Show InChI InChI=1S/C34H40N10O4/c1-5-20(4)42-32(46)24-12-23(13-25(35)14-24)28-17-40-31(41-19(2)3)34(48)44(28)18-29(45)39-16-22-7-6-21(30(36)37)15-27(22)33(47)43-26-8-10-38-11-9-26/h6-15,17,19-20H,5,16,18,35H2,1-4H3,(H3,36,37)(H,39,45)(H,40,41)(H,42,46)(H,38,43,47)/t20-/m1/s1
Reactome pathway
n/an/a 9.40n/an/an/an/an/an/a
Pfizer Corp.
Curated by ChEMBL
Assay Description
Inhibitory concentration against Coagulation factor VIIa
Bioorg Med Chem Lett 15: 3006-11 (2005)
Article DOI: 10.1016/j.bmcl.2005.04.037
BindingDB Entry DOI: 10.7270/Q2SB459T
3D
3D Structure (crystal)