BDBM50167903 CHEMBL3799020
SMILES: Cn1cc(cn1)-c1cc(-c2ccccc2)c2cn[nH]c2c1
InChI Key: InChIKey=OKFWGZUWZRRFJY-UHFFFAOYSA-N
Data: 1 IC50
Activity Spreadsheet -- Enzyme Inhibition Constant Data from BindingDB
Found 1 hit for monomerid = 50167903
Trg + Lig
Ki
nM
ΔG°
kcal/mole
IC50
nM
Kd
nM
EC50/IC50
nM
koff
s-1
kon
M-1s-1
pHTemp
°C
Microtubule-associated protein 2
(Homo sapiens (Human))
BDBM50167903
(CHEMBL3799020)
Show SMILES Cn1cc(cn1)-c1cc(-c2ccccc2)c2cn[nH]c2c1
Show InChI InChI=1S/C17H14N4/c1-21-11-14(9-19-21)13-7-15(12-5-3-2-4-6-12)16-10-18-20-17(16)8-13/h2-11H,1H3,(H,18,20)
n/an/a 2.40E+4n/an/an/an/an/an/a
Takeda California
Curated by ChEMBL
Assay Description
Reversal inhibition of full length recombinant human MetAP2 expressed in baculovirus infected insect Sf9 cells using Met-AMC as substrate measured fo...
Bioorg Med Chem Lett 26: 2774-2778 (2016)
Article DOI: 10.1016/j.bmcl.2016.04.073
BindingDB Entry DOI: 10.7270/Q2DF6T4T