BDBM50167904 CHEMBL3799496
SMILES: Clc1cc(-c2ccccc2)c2cn[nH]c2c1
InChI Key: InChIKey=QHDWHCBIHPDKKB-UHFFFAOYSA-N
Data: 1 IC50
Activity Spreadsheet -- Enzyme Inhibition Constant Data from BindingDB
Found 1 hit for monomerid = 50167904
Trg + Lig
Ki
nM
ΔG°
kcal/mole
IC50
nM
Kd
nM
EC50/IC50
nM
koff
s-1
kon
M-1s-1
pHTemp
°C
Microtubule-associated protein 2
(Homo sapiens (Human))
BDBM50167904
(CHEMBL3799496)
Show SMILES Clc1cc(-c2ccccc2)c2cn[nH]c2c1
Show InChI InChI=1S/C13H9ClN2/c14-10-6-11(9-4-2-1-3-5-9)12-8-15-16-13(12)7-10/h1-8H,(H,15,16)
n/an/a 79n/an/an/an/an/an/a
Takeda California
Curated by ChEMBL
Assay Description
Reversal inhibition of full length recombinant human MetAP2 expressed in baculovirus infected insect Sf9 cells using Met-AMC as substrate measured fo...
Bioorg Med Chem Lett 26: 2774-2778 (2016)
Article DOI: 10.1016/j.bmcl.2016.04.073
BindingDB Entry DOI: 10.7270/Q2DF6T4T