BDBM50167915 CHEMBL3798727
SMILES: FC(F)(F)c1cc(-c2ccc3nccn3c2)c2cn[nH]c2c1
InChI Key: InChIKey=NIDNKFIXOVDXKL-UHFFFAOYSA-N
Data: 2 IC50
Activity Spreadsheet -- Enzyme Inhibition Constant Data from BindingDB
Found 2 hits for monomerid = 50167915
Trg + Lig
Ki
nM
ΔG°
kcal/mole
IC50
nM
Kd
nM
EC50/IC50
nM
koff
s-1
kon
M-1s-1
pHTemp
°C
Cytochrome P450 1A
(Homo sapiens (Human))
BDBM50167915
(CHEMBL3798727)
Show SMILES FC(F)(F)c1cc(-c2ccc3nccn3c2)c2cn[nH]c2c1
Show InChI InChI=1S/C15H9F3N4/c16-15(17,18)10-5-11(12-7-20-21-13(12)6-10)9-1-2-14-19-3-4-22(14)8-9/h1-8H,(H,20,21)
Reactome pathway
n/an/a 316n/an/an/an/an/an/a
Takeda California
Curated by ChEMBL
Assay Description
Inhibition of human CYP1A2 expressed in Escherichia coli DH5-alpha
Bioorg Med Chem Lett 26: 2774-2778 (2016)
Article DOI: 10.1016/j.bmcl.2016.04.073
BindingDB Entry DOI: 10.7270/Q2DF6T4T
Microtubule-associated protein 2
(Homo sapiens (Human))
BDBM50167915
(CHEMBL3798727)
Show SMILES FC(F)(F)c1cc(-c2ccc3nccn3c2)c2cn[nH]c2c1
Show InChI InChI=1S/C15H9F3N4/c16-15(17,18)10-5-11(12-7-20-21-13(12)6-10)9-1-2-14-19-3-4-22(14)8-9/h1-8H,(H,20,21)
n/an/a 4n/an/an/an/an/an/a
Takeda California
Curated by ChEMBL
Assay Description
Reversal inhibition of full length recombinant human MetAP2 expressed in baculovirus infected insect Sf9 cells using Met-AMC as substrate measured fo...
Bioorg Med Chem Lett 26: 2774-2778 (2016)
Article DOI: 10.1016/j.bmcl.2016.04.073
BindingDB Entry DOI: 10.7270/Q2DF6T4T