BDBM50167925 CHEMBL3798047
SMILES: COc1cc(ccc1-c1cc(cc2[nH]ncc12)C(F)(F)F)C(=O)NCCO
InChI Key: InChIKey=MQBAPASGXUTVKD-UHFFFAOYSA-N
Data: 2 IC50  1 EC50
Activity Spreadsheet -- Enzyme Inhibition Constant Data from BindingDB
Found 3 hits for monomerid = 50167925
Trg + Lig
Ki
nM
ΔG°
kcal/mole
IC50
nM
Kd
nM
EC50/IC50
nM
koff
s-1
kon
M-1s-1
pHTemp
°C
Microtubule-associated protein 2
(Homo sapiens (Human))
BDBM50167925
(CHEMBL3798047)
Show SMILES COc1cc(ccc1-c1cc(cc2[nH]ncc12)C(F)(F)F)C(=O)NCCO
Show InChI InChI=1S/C18H16F3N3O3/c1-27-16-6-10(17(26)22-4-5-25)2-3-12(16)13-7-11(18(19,20)21)8-15-14(13)9-23-24-15/h2-3,6-9,25H,4-5H2,1H3,(H,22,26)(H,23,24)
n/an/a 13n/an/an/an/an/an/a
Takeda California
Curated by ChEMBL
Assay Description
Reversal inhibition of full length recombinant human MetAP2 expressed in baculovirus infected insect Sf9 cells using Met-AMC as substrate measured fo...
Bioorg Med Chem Lett 26: 2774-2778 (2016)
Article DOI: 10.1016/j.bmcl.2016.04.073
BindingDB Entry DOI: 10.7270/Q2DF6T4T
Microtubule-associated protein 2
(Homo sapiens (Human))
BDBM50167925
(CHEMBL3798047)
Show SMILES COc1cc(ccc1-c1cc(cc2[nH]ncc12)C(F)(F)F)C(=O)NCCO
Show InChI InChI=1S/C18H16F3N3O3/c1-27-16-6-10(17(26)22-4-5-25)2-3-12(16)13-7-11(18(19,20)21)8-15-14(13)9-23-24-15/h2-3,6-9,25H,4-5H2,1H3,(H,22,26)(H,23,24)
n/an/an/an/a 37n/an/an/an/a
Takeda California
Curated by ChEMBL
Assay Description
Inhibition of MetAP2 in HUVEC assessed as accumulation of N-Met-14-3-3gamma after 24 hrs by Western blot method
Bioorg Med Chem Lett 26: 2774-2778 (2016)
Article DOI: 10.1016/j.bmcl.2016.04.073
BindingDB Entry DOI: 10.7270/Q2DF6T4T
Cytochrome P450 1A
(Homo sapiens (Human))
BDBM50167925
(CHEMBL3798047)
Show SMILES COc1cc(ccc1-c1cc(cc2[nH]ncc12)C(F)(F)F)C(=O)NCCO
Show InChI InChI=1S/C18H16F3N3O3/c1-27-16-6-10(17(26)22-4-5-25)2-3-12(16)13-7-11(18(19,20)21)8-15-14(13)9-23-24-15/h2-3,6-9,25H,4-5H2,1H3,(H,22,26)(H,23,24)
Reactome pathway
n/an/a<5.01E+4n/an/an/an/an/an/a
Takeda California
Curated by ChEMBL
Assay Description
Inhibition of human CYP1A2 expressed in Escherichia coli DH5-alpha
Bioorg Med Chem Lett 26: 2774-2778 (2016)
Article DOI: 10.1016/j.bmcl.2016.04.073
BindingDB Entry DOI: 10.7270/Q2DF6T4T