BDBM50167957 CHEMBL195441::butylbenzene
SMILES: CCCCc1ccccc1
InChI Key: InChIKey=OCKPCBLVNKHBMX-UHFFFAOYSA-N
Data: 1 IC50  1 Kd
PDB links: 2 PDB IDs match this monomer.
Activity Spreadsheet -- Enzyme Inhibition Constant Data from BindingDB
Found 2 hits for monomerid = 50167957
Trg + Lig
Ki
nM
ΔG°
kcal/mole
IC50
nM
Kd
nM
EC50/IC50
nM
koff
s-1
kon
M-1s-1
pHTemp
°C
Cytochrome P450 1A
(Homo sapiens (Human))
BDBM50167957
(CHEMBL195441 | butylbenzene)
Show SMILES CCCCc1ccccc1
Show InChI InChI=1S/C10H14/c1-2-3-7-10-8-5-4-6-9-10/h4-6,8-9H,2-3,7H2,1H3
Reactome pathway
n/an/a 3.70E+6n/an/an/an/an/an/a
University of Kuopio
Curated by ChEMBL
Assay Description
Inhibitory concentration against recombinant human cytochrome P450 1A2
J Med Chem 48: 3808-15 (2005)
Article DOI: 10.1021/jm0489713
BindingDB Entry DOI: 10.7270/Q2R2125K
Lysozyme(L99A)
(Enterobacteria phage T4)
BDBM50167957
(CHEMBL195441 | butylbenzene)
Show SMILES CCCCc1ccccc1
Show InChI InChI=1S/C10H14/c1-2-3-7-10-8-5-4-6-9-10/h4-6,8-9H,2-3,7H2,1H3
NCI pathway
Reactome pathway
n/an/an/a 1.40E+4n/an/an/an/an/a
University of California San Francisco
Curated by ChEMBL
Assay Description
Dissociation constant against T4 lysozyme mutant L99A
J Med Chem 48: 3714-28 (2005)
Article DOI: 10.1021/jm0491187
BindingDB Entry DOI: 10.7270/Q2VT1SW6