BDBM50167962 CHEMBL3798514
SMILES: OC(=O)C(=S)Cc1ccccc1
InChI Key: InChIKey=MKEFQJVTBFZDGF-UHFFFAOYSA-N
Data: 1 IC50
Activity Spreadsheet -- Enzyme Inhibition Constant Data from BindingDB
Found 1 hit for monomerid = 50167962
Trg + Lig
Ki
nM
ΔG°
kcal/mole
IC50
nM
Kd
nM
EC50/IC50
nM
koff
s-1
kon
M-1s-1
pHTemp
°C
C-terminal-binding protein 2
(Homo sapiens (Human))
BDBM50167962
(CHEMBL3798514)
Show SMILES OC(=O)C(=S)Cc1ccccc1
Show InChI InChI=1S/C9H8O2S/c10-9(11)8(12)6-7-4-2-1-3-5-7/h1-5H,6H2,(H,10,11)
n/an/a>3.00E+5n/an/an/an/an/an/a
Virginia Commonwealth University
Curated by ChEMBL
Assay Description
Inhibition of recombinant His6-tagged CtBP2 (31 to 384 residues) (unknown origin) dehydrogenase activity expressed in Escherichia coli BL21-Codonplus...
Bioorg Med Chem 24: 2707-15 (2016)
BindingDB Entry DOI: 10.7270/Q28P62FX