null
SMILES: [#6]-[#8]-c1cc(-[#8])cc(\[#6]=[#6]\c2ccc(-[#8])cc2)c1-[#6]\[#6]=[#6](\[#6])-[#6]-[#6]\[#6]=[#6](\[#6])-[#6]
InChI Key: InChIKey=KHCNVXFENCHDSV-KDDCZFKFSA-N
Activity Spreadsheet -- Enzyme Inhibition Constant Data from BindingDB
Found 1 hit for monomerid = 50168018
Trg + Lig
Ki
nM
ΔG°
kcal/mole
IC50
nM
Kd
nM
EC50/IC50
nM
koff
s-1
kon
M-1s-1
pHTemp
°C
Pancreatic triacylglycerol lipase
(Sus scrofa (Pig))
BDBM50168018
(CHEMBL3798236)
Show SMILES [#6]-[#8]-c1cc(-[#8])cc(\[#6]=[#6]\c2ccc(-[#8])cc2)c1-[#6]\[#6]=[#6](\[#6])-[#6]-[#6]\[#6]=[#6](\[#6])-[#6]
Show InChI InChI=1S/C25H30O3/c1-18(2)6-5-7-19(3)8-15-24-21(16-23(27)17-25(24)28-4)12-9-20-10-13-22(26)14-11-20/h6,8-14,16-17,26-27H,5,7,15H2,1-4H3/b12-9+,19-8-
n/an/a 850n/an/an/an/an/an/a
Catholic University of Daegu
Curated by ChEMBL
Assay Description
Inhibition of porcine pancreatic lipase using p-nitrophenyl butyrate as substrate assessed as formation of p-nitrophenol preincubated for 10 mins fol...
Bioorg Med Chem Lett 26: 2788-2794 (2016)
BindingDB Entry DOI: 10.7270/Q2WD42GF