BDBM50168046 3-(3-Fluoro-phenyl)-8-aza-bicyclo[3.2.1]octane-2-carboxylic acid methyl ester::CHEMBL192924
SMILES: COC(=O)C1C2CCC(CC1c1cccc(F)c1)N2
InChI Key: InChIKey=CKYDEMLAGYDNBA-UHFFFAOYSA-N
Data: 2 KI  3 IC50
Activity Spreadsheet -- Enzyme Inhibition Constant Data from BindingDB
Found 5 hits for monomerid = 50168046
Trg + Lig
Ki
nM
ΔG°
kcal/mole
IC50
nM
Kd
nM
EC50/IC50
nM
koff
s-1
kon
M-1s-1
pHTemp
°C
Norepinephrine Monoamine transporters
(Rattus norvegicus)
BDBM50168046
(3-(3-Fluoro-phenyl)-8-aza-bicyclo[3.2.1]octane-2-c...)
Show SMILES COC(=O)C1C2CCC(CC1c1cccc(F)c1)N2 |THB:2:4:18:6.7|
Show InChI InChI=1S/C15H18FNO2/c1-19-15(18)14-12(8-11-5-6-13(14)17-11)9-3-2-4-10(16)7-9/h2-4,7,11-14,17H,5-6,8H2,1H3
Reactome pathway
4n/an/an/an/an/an/an/an/a
Research Triangle Institute
Curated by ChEMBL
Assay Description
Displacement of [3H]nisoxetine from norepinephrine transporter (NET) of rat cerebral cortex
J Med Chem 48: 3852-7 (2005)
Article DOI: 10.1021/jm058164j
BindingDB Entry DOI: 10.7270/Q2M909FV
Sodium-dependent serotonin transporter
(Rattus norvegicus (rat))
BDBM50168046
(3-(3-Fluoro-phenyl)-8-aza-bicyclo[3.2.1]octane-2-c...)
Show SMILES COC(=O)C1C2CCC(CC1c1cccc(F)c1)N2 |THB:2:4:18:6.7|
Show InChI InChI=1S/C15H18FNO2/c1-19-15(18)14-12(8-11-5-6-13(14)17-11)9-3-2-4-10(16)7-9/h2-4,7,11-14,17H,5-6,8H2,1H3
26.8n/an/an/an/an/an/an/an/a
Research Triangle Institute
Curated by ChEMBL
Assay Description
Displacement of [3H]paroxetine from serotonin transporter (5-HT) of rat cerebral cortex
J Med Chem 48: 3852-7 (2005)
Article DOI: 10.1021/jm058164j
BindingDB Entry DOI: 10.7270/Q2M909FV
Norepinephrine Monoamine transporters
(Rattus norvegicus)
BDBM50168046
(3-(3-Fluoro-phenyl)-8-aza-bicyclo[3.2.1]octane-2-c...)
Show SMILES COC(=O)C1C2CCC(CC1c1cccc(F)c1)N2 |THB:2:4:18:6.7|
Show InChI InChI=1S/C15H18FNO2/c1-19-15(18)14-12(8-11-5-6-13(14)17-11)9-3-2-4-10(16)7-9/h2-4,7,11-14,17H,5-6,8H2,1H3
Reactome pathway
n/an/a 9.70n/an/an/an/an/an/a
Research Triangle Institute
Curated by ChEMBL
Assay Description
Inhibition of [3H]nisoxetine binding to rat cerebral cortex norepinephrine transporter
J Med Chem 48: 3852-7 (2005)
Article DOI: 10.1021/jm058164j
BindingDB Entry DOI: 10.7270/Q2M909FV
Sodium-dependent serotonin transporter
(Rattus norvegicus (rat))
BDBM50168046
(3-(3-Fluoro-phenyl)-8-aza-bicyclo[3.2.1]octane-2-c...)
Show SMILES COC(=O)C1C2CCC(CC1c1cccc(F)c1)N2 |THB:2:4:18:6.7|
Show InChI InChI=1S/C15H18FNO2/c1-19-15(18)14-12(8-11-5-6-13(14)17-11)9-3-2-4-10(16)7-9/h2-4,7,11-14,17H,5-6,8H2,1H3
n/an/a 110n/an/an/an/an/an/a
Research Triangle Institute
Curated by ChEMBL
Assay Description
Inhibition of [3H]paroxetine binding to rat cortex serotonin transporter
J Med Chem 48: 3852-7 (2005)
Article DOI: 10.1021/jm058164j
BindingDB Entry DOI: 10.7270/Q2M909FV
Sodium-dependent dopamine transporter
(Rattus norvegicus (rat))
BDBM50168046
(3-(3-Fluoro-phenyl)-8-aza-bicyclo[3.2.1]octane-2-c...)
Show SMILES COC(=O)C1C2CCC(CC1c1cccc(F)c1)N2 |THB:2:4:18:6.7|
Show InChI InChI=1S/C15H18FNO2/c1-19-15(18)14-12(8-11-5-6-13(14)17-11)9-3-2-4-10(16)7-9/h2-4,7,11-14,17H,5-6,8H2,1H3
Reactome pathway
n/an/a 2.36n/an/an/an/an/an/a
Research Triangle Institute
Curated by ChEMBL
Assay Description
Inhibition of [3H]WIN-35428 binding to rat striatal dopamine transporter
J Med Chem 48: 3852-7 (2005)
Article DOI: 10.1021/jm058164j
BindingDB Entry DOI: 10.7270/Q2M909FV