BDBM50168321 1-Chloro-6-(2-fluoro-4-hydroxy-phenyl)-naphthalen-2-ol::CHEMBL447837
SMILES: Oc1ccc(c(F)c1)-c1ccc2c(Cl)c(O)ccc2c1
InChI Key: InChIKey=XIWROJLPONIAKV-UHFFFAOYSA-N
Data: 2 IC50
Activity Spreadsheet -- Enzyme Inhibition Constant Data from BindingDB
Found 2 hits for monomerid = 50168321
Trg + Lig
Ki
nM
ΔG°
kcal/mole
IC50
nM
Kd
nM
EC50/IC50
nM
koff
s-1
kon
M-1s-1
pHTemp
°C
Estrogen receptor
(Homo sapiens (Human))
BDBM50168321
(1-Chloro-6-(2-fluoro-4-hydroxy-phenyl)-naphthalen-...)
Show SMILES Oc1ccc(c(F)c1)-c1ccc2c(Cl)c(O)ccc2c1
Show InChI InChI=1S/C16H10ClFO2/c17-16-13-4-1-9(7-10(13)2-6-15(16)20)12-5-3-11(19)8-14(12)18/h1-8,19-20H
n/an/a 58n/an/an/an/an/an/a
Wyeth Research
Curated by ChEMBL
Assay Description
Inhibition of [3H]-17-beta-estradiol binding to human estrogen receptor alpha expressed in Escherichia coli
J Med Chem 48: 3953-79 (2005)
Article DOI: 10.1021/jm058173s
BindingDB Entry DOI: 10.7270/Q2QF8SF0
Estradiol receptor beta (ERβ)
(Homo sapiens (Human))
BDBM50168321
(1-Chloro-6-(2-fluoro-4-hydroxy-phenyl)-naphthalen-...)
Show SMILES Oc1ccc(c(F)c1)-c1ccc2c(Cl)c(O)ccc2c1
Show InChI InChI=1S/C16H10ClFO2/c17-16-13-4-1-9(7-10(13)2-6-15(16)20)12-5-3-11(19)8-14(12)18/h1-8,19-20H
n/an/a 1.20n/an/an/an/an/an/a
Wyeth Research
Curated by ChEMBL
Assay Description
Inhibition of [3H]-17-beta-estradiol binding to human estrogen receptor beta expressed in Escherichia coli
J Med Chem 48: 3953-79 (2005)
Article DOI: 10.1021/jm058173s
BindingDB Entry DOI: 10.7270/Q2QF8SF0