BDBM50168323 1-CHLORO-6-(4-HYDROXYPHENYL)-2-NAPHTHOL::1-Chloro-6-(4-hydroxy-phenyl)-naphthalen-2-ol::CHEMBL364092
SMILES: Oc1ccc(cc1)-c1ccc2c(Cl)c(O)ccc2c1
InChI Key: InChIKey=YHEHVRSGKUYDON-UHFFFAOYSA-N
Data: 2 IC50
PDB links: 1 PDB ID matches this monomer.
Activity Spreadsheet -- Enzyme Inhibition Constant Data from BindingDB
Found 2 hits for monomerid = 50168323
Trg + Lig
Ki
nM
ΔG°
kcal/mole
IC50
nM
Kd
nM
EC50/IC50
nM
koff
s-1
kon
M-1s-1
pHTemp
°C
Estrogen receptor
(Homo sapiens (Human))
BDBM50168323
(1-CHLORO-6-(4-HYDROXYPHENYL)-2-NAPHTHOL | 1-Chloro...)
Show SMILES Oc1ccc(cc1)-c1ccc2c(Cl)c(O)ccc2c1
Show InChI InChI=1S/C16H11ClO2/c17-16-14-7-3-11(9-12(14)4-8-15(16)19)10-1-5-13(18)6-2-10/h1-9,18-19H
n/an/a 91n/an/an/an/an/an/a
Wyeth Research
Curated by ChEMBL
Assay Description
Inhibition of [3H]-17-beta-estradiol binding to human estrogen receptor alpha expressed in Escherichia coli
J Med Chem 48: 3953-79 (2005)
Article DOI: 10.1021/jm058173s
BindingDB Entry DOI: 10.7270/Q2QF8SF0
Estradiol receptor beta (ERβ)
(Homo sapiens (Human))
BDBM50168323
(1-CHLORO-6-(4-HYDROXYPHENYL)-2-NAPHTHOL | 1-Chloro...)
Show SMILES Oc1ccc(cc1)-c1ccc2c(Cl)c(O)ccc2c1
Show InChI InChI=1S/C16H11ClO2/c17-16-14-7-3-11(9-12(14)4-8-15(16)19)10-1-5-13(18)6-2-10/h1-9,18-19H
n/an/a 2.52n/an/an/an/an/an/a
Wyeth Research
Curated by ChEMBL
Assay Description
Inhibition of [3H]-17-beta-estradiol binding to human estrogen receptor beta expressed in Escherichia coli
J Med Chem 48: 3953-79 (2005)
Article DOI: 10.1021/jm058173s
BindingDB Entry DOI: 10.7270/Q2QF8SF0
3D
3D Structure (crystal)