BDBM50168347 6-(2-Chloro-4-hydroxy-phenyl)-naphthalen-2-ol::CHEMBL195311
SMILES: Oc1ccc(c(Cl)c1)-c1ccc2cc(O)ccc2c1
InChI Key: InChIKey=FNSIACDWDZGUHN-UHFFFAOYSA-N
Data: 2 IC50
Activity Spreadsheet -- Enzyme Inhibition Constant Data from BindingDB
Found 2 hits for monomerid = 50168347
Trg + Lig
Ki
nM
ΔG°
kcal/mole
IC50
nM
Kd
nM
EC50/IC50
nM
koff
s-1
kon
M-1s-1
pHTemp
°C
Estrogen receptor
(Homo sapiens (Human))
BDBM50168347
(6-(2-Chloro-4-hydroxy-phenyl)-naphthalen-2-ol | CH...)
Show SMILES Oc1ccc(c(Cl)c1)-c1ccc2cc(O)ccc2c1
Show InChI InChI=1S/C16H11ClO2/c17-16-9-14(19)5-6-15(16)12-2-1-11-8-13(18)4-3-10(11)7-12/h1-9,18-19H
n/an/a 10n/an/an/an/an/an/a
Wyeth Research
Curated by ChEMBL
Assay Description
Inhibition of [3H]-17-beta-estradiol binding to human estrogen receptor alpha expressed in Escherichia coli
J Med Chem 48: 3953-79 (2005)
Article DOI: 10.1021/jm058173s
BindingDB Entry DOI: 10.7270/Q2QF8SF0
Estradiol receptor beta (ERβ)
(Homo sapiens (Human))
BDBM50168347
(6-(2-Chloro-4-hydroxy-phenyl)-naphthalen-2-ol | CH...)
Show SMILES Oc1ccc(c(Cl)c1)-c1ccc2cc(O)ccc2c1
Show InChI InChI=1S/C16H11ClO2/c17-16-9-14(19)5-6-15(16)12-2-1-11-8-13(18)4-3-10(11)7-12/h1-9,18-19H
n/an/a 1.40n/an/an/an/an/an/a
Wyeth Research
Curated by ChEMBL
Assay Description
Inhibition of [3H]-17-beta-estradiol binding to human estrogen receptor beta expressed in Escherichia coli
J Med Chem 48: 3953-79 (2005)
Article DOI: 10.1021/jm058173s
BindingDB Entry DOI: 10.7270/Q2QF8SF0