BDBM50168584 4-(3-Ethyl-3H-imidazo[4,5-c]pyridin-2-yl)-furazan-3-ylamine::CHEMBL185710
SMILES: CCn1c(nc2ccncc12)-c1nonc1N
InChI Key: InChIKey=XDQUYQKTDSDQRL-UHFFFAOYSA-N
Data: 1 IC50
Activity Spreadsheet -- Enzyme Inhibition Constant Data from BindingDB
Found 1 hit for monomerid = 50168584
Trg + Lig
Ki
nM
ΔG°
kcal/mole
IC50
nM
Kd
nM
EC50/IC50
nM
koff
s-1
kon
M-1s-1
pHTemp
°C
Ribosomal protein S6 kinase alpha 5
(Homo sapiens (Human))
BDBM50168584
(4-(3-Ethyl-3H-imidazo[4,5-c]pyridin-2-yl)-furazan-...)
Show SMILES CCn1c(nc2ccncc12)-c1nonc1N
Show InChI InChI=1S/C10H10N6O/c1-2-16-7-5-12-4-3-6(7)13-10(16)8-9(11)15-17-14-8/h3-5H,2H2,1H3,(H2,11,15)
NCI pathway
Reactome pathway
n/an/a 1.54E+3n/an/an/an/an/an/a
GlaxoSmithKline Pharmaceuticals
Curated by ChEMBL
Assay Description
Inhibitory concentration exhibited towards MSK-1
Bioorg Med Chem Lett 15: 3402-6 (2005)
Article DOI: 10.1016/j.bmcl.2005.05.021
BindingDB Entry DOI: 10.7270/Q2Z037P9