BDBM50168591 4-(1-Ethyl-6-fluoro-1H-benzoimidazol-2-yl)-furazan-3-ylamine::CHEMBL426800
SMILES: CCn1c(nc2ccc(F)cc12)-c1nonc1N
InChI Key: InChIKey=CFCWMGRWMVZFQN-UHFFFAOYSA-N
Data: 1 IC50
Activity Spreadsheet -- Enzyme Inhibition Constant Data from BindingDB
Found 1 hit for monomerid = 50168591
Trg + Lig
Ki
nM
ΔG°
kcal/mole
IC50
nM
Kd
nM
EC50/IC50
nM
koff
s-1
kon
M-1s-1
pHTemp
°C
Ribosomal protein S6 kinase alpha 5
(Homo sapiens (Human))
BDBM50168591
(4-(1-Ethyl-6-fluoro-1H-benzoimidazol-2-yl)-furazan...)
Show SMILES CCn1c(nc2ccc(F)cc12)-c1nonc1N
Show InChI InChI=1S/C11H10FN5O/c1-2-17-8-5-6(12)3-4-7(8)14-11(17)9-10(13)16-18-15-9/h3-5H,2H2,1H3,(H2,13,16)
NCI pathway
Reactome pathway
n/an/a 2.12E+3n/an/an/an/an/an/a
GlaxoSmithKline Pharmaceuticals
Curated by ChEMBL
Assay Description
Inhibitory concentration exhibited towards MSK-1
Bioorg Med Chem Lett 15: 3402-6 (2005)
Article DOI: 10.1016/j.bmcl.2005.05.021
BindingDB Entry DOI: 10.7270/Q2Z037P9